{"text_format":"1","workbook":"xlsx","n_sheets":5,"sheets":["Zał.1_WPF_bazowy","WPF_AnalizaWsk_ProjektowanieJST","definicja","rysunki","DaneZrodlowe"],"not_rendered":{"charts":12,"images":0,"macros":1,"external_links":0,"defined_names":14,"comments":0,"pivot_tables":0},"unopened":[],"bounds":{"document_bytes":16777216,"sheet_cells":100000,"rows_first":2000,"rows_last":500,"rows_between":2000,"halvings":0,"cell_chars":16384,"cell_head_chars":4096},"cells_cut":0,"cells_raw":0,"read":"whole","date_system":"1900"}

{"sheet":"Zał.1_WPF_bazowy","index":0,"n_rows":203,"n_cols":12,"rows_kept":203,"cut":false,"hidden":false,"merged":[[7,4,7,5],[6,4,6,7]]}
[null,"Raport z systemu BeSTi@ - narzędzie opracowane przez Zespół ds. rozwoju technologii IT przy KR RIO",null,null,null,null,null,null,"Układ WPF wg Rozporządzenia Ministra Finansów z dnia 10.01.2013 po zmianie z DzU.2013.1736 oraz DzU.2014.1127"]
[null,"Poniższej tabeli WPF nie należy modyfikować. "]
[null,"Do szacowania i analiz służy arkusz \"WPF_AnalizaWsk_Projektowanie\""]
[null,"Nr Uchwały:",null,{"$f":"DaneZrodlowe!B4","v":"1"}]
[null,"Nazwa JST:",null,{"$f":"DaneZrodlowe!C4","v":"KRZYŻANÓW"}]
[null,"WPF za lata:",null,{"$f":"CONCATENATE(DaneZrodlowe!N1,\" - \",DaneZrodlowe!Q1)","v":"2015 - 2018"}]
[null,null,null,null,"z eWPF"]
[null,null,null,null,"Wykonanie ",null,"Plan 3 kw.","Wykonanie ",{"$f":"\"\"","v":""}]
["X","Lp.","Nazwy serii (rysunki)","Wyszczególnienie",{"$f":"+F9-1","v":2012},{"$f":"+G9-1","v":2013},{"$f":"+H9","v":2014},{"$f":"+I9-1","v":2014},{"$f":"+DaneZrodlowe!$N$1","v":2015},{"$f":"+I9+1","v":2016},{"$f":"+J9+1","v":2017},{"$f":"+K9+1","v":2018}]
["x",1,"Dochody ogółem","Dochody ogółem",{"$f":"14062028.15","v":14062028.15},{"$f":"12708280.6","v":12708280.6},{"$f":"15086054.13","v":15086054.130000001},{"$f":"15409938.1","v":15409938.1},{"$f":"11885236","v":11885236},{"$f":"13116110","v":13116110},{"$f":"13247270","v":13247270},{"$f":"13379740","v":13379740}]
["x","1.1"," Dochody bieżące","Dochody bieżące",{"$f":"12660364.54","v":12660364.539999999},{"$f":"11968299.93","v":11968299.93},{"$f":"12203735.06","v":12203735.060000001},{"$f":"12527619.03","v":12527619.029999999},{"$f":"11877336","v":11877336},{"$f":"13116110","v":13116110},{"$f":"13247270","v":13247270},{"$f":"13379740","v":13379740}]
[null,"1.1.1","  dochody z tytułu udziału we wpływach z podatku dochodowego od osób fizycznych","dochody z tytułu udziału we wpływach z podatku dochodowego od osób fizycznych",{"$f":"1398132","v":1398132},{"$f":"1390365","v":1390365},{"$f":"1335088","v":1335088},{"$f":"1335088","v":1335088},{"$f":"1418820","v":1418820},{"$f":"1433008","v":1433008},{"$f":"1447338","v":1447338},{"$f":"1461811","v":1461811}]
[null,"1.1.2","  dochody z tytułu udziału we wpływach z podatku dochodowego od osób prawnych","dochody z tytułu udziału we wpływach z podatku dochodowego od osób prawnych",{"$f":"873.76","v":873.76},{"$f":"654.23","v":654.23},{"$f":"1000","v":1000},{"$f":"1000","v":1000},{"$f":"2000","v":2000},{"$f":"2000","v":2000},{"$f":"2000","v":2000},{"$f":"2000","v":2000}]
[null,"1.1.3","  podatki i opłaty","podatki i opłaty",{"$f":"4719070.97","v":4719070.97},{"$f":"3241540.05","v":3241540.05},{"$f":"3910601","v":3910601},{"$f":"3902601","v":3902601},{"$f":"4676056","v":4676056},{"$f":"5842816","v":5842816},{"$f":"5901244","v":5901244},{"$f":"5960256","v":5960256}]
[null,"1.1.3.1","   z podatku od nieruchomości","z podatku od nieruchomości",{"$f":"1608877.11","v":1608877.11},{"$f":"1467888.16","v":1467888.16},{"$f":"1532389","v":1532389},{"$f":"1532389","v":1532389},{"$f":"1534000","v":1534000},{"$f":"2669340","v":2669340},{"$f":"2696034","v":2696034},{"$f":"2723000","v":2723000}]
[null,"1.1.4","  z subwencji ogólnej","z subwencji ogólnej",{"$f":"4481337","v":4481337},{"$f":"4504728","v":4504728},{"$f":"3274658","v":3274658},{"$f":"3274658","v":3274658},{"$f":"3862767","v":3862767},{"$f":"3901395","v":3901395},{"$f":"3940400","v":3940400},{"$f":"3979813","v":3979813}]
[null,"1.1.5","  z tytułu dotacji i środków przeznaczonych na cele bieżące","z tytułu dotacji i środków przeznaczonych na cele bieżące",{"$f":"2060950.81","v":2060950.81},{"$f":"2099883.43","v":2099883.4300000002},{"$f":"2095696.81","v":2095696.81},{"$f":"2433356.95","v":2433356.9500000002},{"$f":"1273753","v":1273753},{"$f":"1273753","v":1273753},{"$f":"1273753","v":1273753},{"$f":"1273753","v":1273753}]
["x","1.2","  Dochody majątkowe","Dochody majątkowe, w tym",{"$f":"1401663.61","v":1401663.61},{"$f":"739980.67","v":739980.67},{"$f":"2882319.07","v":2882319.07},{"$f":"2882319.07","v":2882319.07},{"$f":"7900","v":7900},{"$f":"0","v":0},{"$f":"0","v":0},{"$f":"0","v":0}]
["x","1.2.1","  ze sprzedaży majątku","ze sprzedaży majątku",{"$f":"69038.91","v":69038.91},{"$f":"6200","v":6200},{"$f":"220000","v":220000},{"$f":"220000","v":220000},{"$f":"0","v":0},{"$f":"0","v":0},{"$f":"0","v":0},{"$f":"0","v":0}]
[null,"1.2.2","  z tytułu dotacji oraz środków przeznaczonych na inwestycje","z tytułu dotacji oraz środków przeznaczonych na inwestycje",{"$f":"1332324.7","v":1332324.7},{"$f":"720552.67","v":720552.67},{"$f":"2603609.07","v":2603609.0699999998},{"$f":"2603609.07","v":2603609.0699999998},{"$f":"7900","v":7900},{"$f":"0","v":0},{"$f":"0","v":0},{"$f":"0","v":0}]
["x",2,"Wydatki ogółem","Wydatki ogółem",{"$f":"11481546.43","v":11481546.43},{"$f":"13777530.74","v":13777530.74},{"$f":"14983740.94","v":14983740.939999999},{"$f":"15322124.91","v":15322124.91},{"$f":"13118844","v":13118844},{"$f":"12414710","v":12414710},{"$f":"12545882.4","v":12545882.4},{"$f":"13379740","v":13379740}]
["x","2.1"," Wydatki bieżące","Wydatki bieżące, w tym:",{"$f":"9055670.43","v":9055670.4299999997},{"$f":"9384342.04","v":9384342.0399999991},{"$f":"9999493.87","v":9999493.8699999992},{"$f":"10334477.84","v":10334477.84},{"$f":"9369229","v":9369229},{"$f":"9654720","v":9654720},{"$f":"9820000.4","v":9820000.4000000004},{"$f":"10030650","v":10030650}]
["x","2.1.1","  z tytułu poręczeń i gwarancji","z tytułu poręczeń i gwarancji",{"$f":"0","v":0},{"$f":"0","v":0},{"$f":"0","v":0},{"$f":"0","v":0},{"$f":"0","v":0},{"$f":"0","v":0},{"$f":"0","v":0},{"$f":"0","v":0}]
["x","2.1.1.1","   w tym: gwarancje i poręczenia podlegające wyłączeniu z limitu spłaty zobowiązań, o którym mowa w art. 243 ustawy","w tym: gwarancje i poręczenia podlegające wyłączeniu z limitu spłaty zobowiązań, o którym mowa w art. 243 ustawy",{"$f":"0","v":0},{"$f":"0","v":0},{"$f":"0","v":0},{"$f":"0","v":0},{"$f":"0","v":0},{"$f":"0","v":0},{"$f":"0","v":0},{"$f":"0","v":0}]
[null,"2.1.2","   na spłatę przejętych zobowiązań samodzielnego publicznego zakładu opieki zdrowotnej przekształconego na zasadach określonych w przepisach  o działalności leczniczej, w wysokości w jakiej nie podlegają sfinansowaniu dotacją z budżetu państwa","na spłatę przejętych zobowiązań samodzielnego publicznego zakładu opieki zdrowotnej przekształconego na zasadach określonych w przepisach  o działalności leczniczej, w wysokości w jakiej nie podlegają sfinansowaniu dotacją z budżetu państwa",{"$f":"0","v":0},{"$f":"0","v":0},{"$f":"0","v":0},{"$f":"0","v":0},{"$f":"0","v":0},{"$f":"0","v":0},{"$f":"0","v":0},{"$f":"0","v":0}]
["x","2.1.3","  wydatki na obsługę długu, w tym:","wydatki na obsługę długu, w tym:",{"$f":"84758.58","v":84758.58},{"$f":"36975.83","v":36975.83},{"$f":"20000","v":20000},{"$f":"20000","v":20000},{"$f":"100000","v":100000},{"$f":"70000","v":70000},{"$f":"34000","v":34000},{"$f":"0","v":0}]
["x","2.1.3.1","   odsetki i dyskonto określone w art. 243 ust. 1 ustawy, w tym:","odsetki i dyskonto określone w art. 243 ust. 1 ustawy, w tym:",{"$f":"83194.59","v":83194.59},{"$f":"36075.83","v":36075.83},{"$f":"20000","v":20000},{"$f":"20000","v":20000},{"$f":"100000","v":100000},{"$f":"70000","v":70000},{"$f":"34000","v":34000},{"$f":"0","v":0}]
["x","2.1.3.1.1","    odsetki i dyskonto podlegające wyłączeniu z limitu spłaty zobowiązań, o którym mowa w art. 243 ustawy, w terminie nie dłuższym niż 90 dni po zakończeniu programu, projektu lub zadania i otrzymaniu refundacji z tych środków (bez odsetek i dyskonta od zobowiązań na wkład krajowy)","odsetki i dyskonto podlegające wyłączeniu z limitu spłaty zobowiązań, o którym mowa w art. 243 ustawy, w terminie nie dłuższym niż 90 dni po zakończeniu programu, projektu lub zadania i otrzymaniu refundacji z tych środków (bez odsetek i dyskonta od zobowiązań na wkład krajowy)",{"$f":"0","v":0},{"$f":"0","v":0},{"$f":"0","v":0},{"$f":"0","v":0},{"$f":"0","v":0},{"$f":"0","v":0},{"$f":"0","v":0},{"$f":"0","v":0}]
["x","2.1.3.1.2","    odsetki i dyskonto podlegające wyłączeniu z limitu spłaty zobowiązań, o którym mowa w art. 243 ustawy, z tytułu zobowiązań  zaciągniętych na wkład krajowy","odsetki i dyskonto podlegające wyłączeniu z limitu spłaty zobowiązań, o którym mowa w art. 243 ustawy, z tytułu zobowiązań  zaciągniętych na wkład krajowy",{"$f":"0","v":0},{"$f":"0","v":0},{"$f":"0","v":0},{"$f":"0","v":0},{"$f":"0","v":0},{"$f":"0","v":0},{"$f":"0","v":0},{"$f":"0","v":0}]
["x","2.2"," Wydatki majątkowe","Wydatki majątkowe",{"$f":"2425876","v":2425876},{"$f":"4393188.7","v":4393188.7},{"$f":"4984247.07","v":4984247.07},{"$f":"4987647.07","v":4987647.07},{"$f":"3749615","v":3749615},{"$f":"2759990","v":2759990},{"$f":"2725882","v":2725882},{"$f":"3349090","v":3349090}]
["x",3,"Wynik budżetu","Wynik budżetu",{"$f":"2580481.72","v":2580481.7200000002},{"$f":"-1069250.14","v":-1069250.1399999999},{"$f":"102313.19","v":102313.19},{"$f":"87813.19","v":87813.19},{"$f":"-1233608","v":-1233608},{"$f":"701400","v":701400},{"$f":"701387.6","v":701387.6},{"$f":"0","v":0}]
["x",4,"Przychody budżetu","Przychody budżetu",{"$f":"1050519.37","v":1050519.3700000001},{"$f":"2496104.74","v":2496104.7400000002},{"$f":"696643","v":696643},{"$f":"541963.4","v":541963.4},{"$f":"1402787.6","v":1402787.6},{"$f":"0","v":0},{"$f":"0","v":0},{"$f":"0","v":0}]
["x","4.1"," Nadwyżka budżetowa z lat ubiegłych","Nadwyżka budżetowa z lat ubiegłych",{"$f":"0","v":0},{"$f":"959945.09","v":959945.09},{"$f":"0","v":0},{"$f":"0","v":0},{"$f":"0","v":0},{"$f":"0","v":0},{"$f":"0","v":0},{"$f":"0","v":0}]
["x","4.1.1","  w tym na pokrycie deficytu budżetu","w tym na pokrycie deficytu budżetu",{"$f":"0","v":0},{"$f":"247105.63","v":247105.63},{"$f":"0","v":0},{"$f":"0","v":0},{"$f":"0","v":0},{"$f":"0","v":0},{"$f":"0","v":0},{"$f":"0","v":0}]
["x","4.2"," Wolne środki, o których mowa w art. 217 ust.2 pkt 6 ustawy","Wolne środki, o których mowa w art. 217 ust.2 pkt 6 ustawy",{"$f":"902519.37","v":902519.37},{"$f":"1422477.65","v":1422477.65},{"$f":"696643","v":696643},{"$f":"516963.4","v":516963.4},{"$f":"0","v":0},{"$f":"0","v":0},{"$f":"0","v":0},{"$f":"0","v":0}]
["x","4.2.1","   w tym na pokrycie deficytu budżetu","w tym na pokrycie deficytu budżetu",{"$f":"0","v":0},{"$f":"733144.51","v":733144.51},{"$f":"0","v":0},{"$f":"0","v":0},{"$f":"0","v":0},{"$f":"0","v":0},{"$f":"0","v":0},{"$f":"0","v":0}]
["x","4.3","  Kredyty, pożyczki, emisja papierów wartościowych","Kredyty, pożyczki, emisja papierów wartościowych",{"$f":"148000","v":148000},{"$f":"89000","v":89000},{"$f":"0","v":0},{"$f":"0","v":0},{"$f":"1402787.6","v":1402787.6},{"$f":"0","v":0},{"$f":"0","v":0},{"$f":"0","v":0}]
["x","4.3.1","   w tym na pokrycie deficytu budżetu","w tym na pokrycie deficytu budżetu",{"$f":"0","v":0},{"$f":"89000","v":89000},{"$f":"0","v":0},{"$f":"0","v":0},{"$f":"1233608","v":1233608},{"$f":"0","v":0},{"$f":"0","v":0},{"$f":"0","v":0}]
["x","4.4"," Inne przychody niezwiązane z zaciągnięciem długu"," Inne przychody niezwiązane z zaciągnięciem długu",{"$f":"0","v":0},{"$f":"24682","v":24682},{"$f":"0","v":0},{"$f":"25000","v":25000},{"$f":"0","v":0},{"$f":"0","v":0},{"$f":"0","v":0},{"$f":"0","v":0}]
["x","4.4.1","   w tym na pokrycie deficytu budżetu","w tym na pokrycie deficytu budżetu",{"$f":"0","v":0},{"$f":"0","v":0},{"$f":"0","v":0},{"$f":"0","v":0},{"$f":"0","v":0},{"$f":"0","v":0},{"$f":"0","v":0},{"$f":"0","v":0}]
["x",5,"Rozchody budżetu","Rozchody budżetu",{"$f":"1303202.75","v":1303202.75},{"$f":"737521.46","v":737521.46},{"$f":"798956.19","v":798956.19},{"$f":"629776.59","v":629776.59},{"$f":"169179.6","v":169179.6},{"$f":"701400","v":701400},{"$f":"701387.6","v":701387.6},{"$f":"0","v":0}]
["x","5.1"," Spłaty rat kapitałowych kredytów i pożyczek oraz wykup papierów wartościowych","Spłaty rat kapitałowych kredytów i pożyczek oraz wykup papierów wartościowych",{"$f":"1278520.75","v":1278520.75},{"$f":"737521.46","v":737521.46},{"$f":"773956.19","v":773956.19},{"$f":"604776.59","v":604776.59},{"$f":"169179.6","v":169179.6},{"$f":"701400","v":701400},{"$f":"701387.6","v":701387.6},{"$f":"0","v":0}]
["x","5.1.1","  w tym łączna kwota przypadających na dany rok kwot ustawowych wyłączeń z limitu spłaty zobowiązań, o którym mowa w art. 243 ustawy, z tego:","w tym łączna kwota przypadających na dany rok kwot ustawowych wyłączeń z limitu spłaty zobowiązań, o którym mowa w art. 243 ustawy, z tego:",{"$f":"595645.15","v":595645.15},{"$f":"0","v":0},{"$f":"89000","v":89000},{"$f":"89000","v":89000},{"$f":"0","v":0},{"$f":"0","v":0},{"$f":"0","v":0},{"$f":"0","v":0}]
["x","5.1.1.1","   kwota przypadających na dany rok kwot ustawowych wyłączeń określonych w art. 243 ust. 3 ustawy","kwota przypadających na dany rok kwot ustawowych wyłączeń określonych w art. 243 ust. 3 ustawy",{"$f":"595645.15","v":595645.15},{"$f":"0","v":0},{"$f":"89000","v":89000},{"$f":"89000","v":89000},{"$f":"0","v":0},{"$f":"0","v":0},{"$f":"0","v":0},{"$f":"0","v":0}]
["x","5.1.1.2","   kwota przypadających na dany rok kwot ustawowych wyłączeń określonych w art. 243 ust. 3a ustawy","kwota przypadających na dany rok kwot ustawowych wyłączeń określonych w art. 243 ust. 3a ustawy",{"$f":"0","v":0},{"$f":"0","v":0},{"$f":"0","v":0},{"$f":"0","v":0},{"$f":"0","v":0},{"$f":"0","v":0},{"$f":"0","v":0},{"$f":"0","v":0}]
["x","5.1.1.3","   kwota przypadających na dany rok kwot ustawowych wyłączeń innych niż określone w art. 243 ustawy","kwota przypadających na dany rok kwot ustawowych wyłączeń innych niż określone w art. 243 ustawy",{"$f":"0","v":0},{"$f":"0","v":0},{"$f":"0","v":0},{"$f":"0","v":0},{"$f":"0","v":0},{"$f":"0","v":0},{"$f":"0","v":0},{"$f":"0","v":0}]
[null,"5.2"," Inne rozchody niezwiązane ze spłatą długu"," Inne rozchody niezwiązane ze spłatą długu",{"$f":"24682","v":24682},{"$f":"0","v":0},{"$f":"25000","v":25000},{"$f":"25000","v":25000},{"$f":"0","v":0},{"$f":"0","v":0},{"$f":"0","v":0},{"$f":"0","v":0}]
["x",6,"Kwota długu","Kwota długu",{"$f":"1422477.65","v":1422477.65},{"$f":"773956.19","v":773956.19},{"$f":"0","v":0},{"$f":"169179.6","v":169179.6},{"$f":"1402787.6","v":1402787.6},{"$f":"701387.6","v":701387.6},{"$f":"0","v":0},{"$f":"0","v":0}]
[null,7,"Kwota zobowiązań wynikających z przejęcia przez jednostkę samorządu terytorialnego zobowiązań po likwidowanych i przekształcanych jednostkach zaliczanych do sektora  finansów publicznych","Kwota zobowiązań wynikających z przejęcia przez jednostkę samorządu terytorialnego zobowiązań po likwidowanych i przekształcanych jednostkach zaliczanych do sektora  finansów publicznych",{"$f":"0","v":0},{"$f":"0","v":0},{"$f":"0","v":0},{"$f":"0","v":0},{"$f":"0","v":0},{"$f":"0","v":0},{"$f":"0","v":0},{"$f":"0","v":0}]
[null,8,"Relacja zrównoważenia wydatków bieżących, o której mowa w art. 242 ustawy","Relacja zrównoważenia wydatków bieżących, o której mowa w art. 242 ustawy","x","x","x","x","x","x","x","x"]
[null,"8.1"," Różnica między dochodami bieżącymi a  wydatkami bieżącymi","Różnica między dochodami bieżącymi a  wydatkami bieżącymi",{"$f":"3604694.11","v":3604694.11},{"$f":"2583957.89","v":2583957.89},{"$f":"2204241.19","v":2204241.19},{"$f":"2193141.19","v":2193141.19},{"$f":"2508107","v":2508107},{"$f":"3461390","v":3461390},{"$f":"3427269.6","v":3427269.6},{"$f":"3349090","v":3349090}]
[null,"8.2"," Różnica między dochodami bieżącymi, skorygowanymi o środki a wydatkami bieżącymi, pomniejszonymi  o wydatki","Różnica między dochodami bieżącymi, skorygowanymi o środki a wydatkami bieżącymi, pomniejszonymi  o wydatki",{"$f":"4507213.48","v":4507213.4800000004},{"$f":"4966380.63","v":4966380.63},{"$f":"2900884.19","v":2900884.19},{"$f":"2710104.59","v":2710104.59},{"$f":"2508107","v":2508107},{"$f":"3461390","v":3461390},{"$f":"3427269.6","v":3427269.6},{"$f":"3349090","v":3349090}]
["x",9,"Wskaźnik spłaty zobowiązań","Wskaźnik spłaty zobowiązań","x","x","x","x","x","x","x","x"]
["x","9.1","(R+O) / D (bez wyłączeń)","Wskaźnik planowanej łącznej kwoty spłaty zobowiązań, o której mowa w art. 243 ust. 1 ustawy do dochodów, bez uwzględnienia zobowiązań związku współtworzonego przez jednostkę samorządu terytorialnego  i bez uwzględnienia ustawowych wyłączeń przypadających na dany rok.",{"$f":"0.0968","v":9.6799999999999997E-2},{"$f":"0.0609","v":6.0900000000000003E-2},{"$f":"0.0526","v":5.2600000000000001E-2},{"$f":"0.0405","v":4.0500000000000001E-2},{"$f":"0.0226","v":2.2599999999999999E-2},{"$f":"0.0588","v":5.8799999999999998E-2},{"$f":"0.0555","v":5.5500000000000001E-2},{"$f":"0","v":0}]
["x","9.2","(R+O) / D (z wyłączeniami)","Wskaźnik planowanej łącznej kwoty spłaty zobowiązań, o której mowa w art. 243 ust. 1 ustawy do dochodów, bez uwzględnienia zobowiązań związku współtworzonego przez jednostkę samorządu terytorialnego, po uwzględnieniu ustawowych wyłączeń przypadających na dany rok.",{"$f":"0.0545","v":5.45E-2},{"$f":"0.0609","v":6.0900000000000003E-2},{"$f":"0.0467","v":4.6699999999999998E-2},{"$f":"0.0348","v":3.4799999999999998E-2},{"$f":"0.0226","v":2.2599999999999999E-2},{"$f":"0.0588","v":5.8799999999999998E-2},{"$f":"0.0555","v":5.5500000000000001E-2},{"$f":"0","v":0}]
["x","9.3"," Kwota zobowiązań związku współtworzonego przez jednostkę samorządu terytorialnego przypadających do spłaty w danym roku budżetowym, podlegająca doliczeniu zgodnie z art. 244 ustawy","Kwota zobowiązań związku współtworzonego przez jednostkę samorządu terytorialnego przypadających do spłaty w danym roku budżetowym, podlegająca doliczeniu zgodnie z art. 244 ustawy",{"$f":"0","v":0},{"$f":"0","v":0},{"$f":"0","v":0},{"$f":"0","v":0},{"$f":"0","v":0},{"$f":"0","v":0},{"$f":"0","v":0},{"$f":"0","v":0}]
["x","9.4","(R+O) / D (z wyłączeniami i zobowiązaniami związków)","Wskaźnik planowanej łącznej kwoty spłaty zobowiązań, o której mowa w art. 243 ust. 1 ustawy do dochodów, po uwzględnieniu zobowiązań związku współtworzonego przez jednostkę samorządu terytorialnego oraz po uwzględnieniu ustawowych wyłączeń przypadających na dany rok",{"$f":"0.0545","v":5.45E-2},{"$f":"0.0609","v":6.0900000000000003E-2},{"$f":"0.0467","v":4.6699999999999998E-2},{"$f":"0.0348","v":3.4799999999999998E-2},{"$f":"0.0226","v":2.2599999999999999E-2},{"$f":"0.0588","v":5.8799999999999998E-2},{"$f":"0.0555","v":5.5500000000000001E-2},{"$f":"0","v":0}]
["x","9.5"," Wskaźnik dochodów bieżących powiększonych o dochody ze sprzedaży majątku oraz pomniejszonych o wydatki bieżące, do dochodów budżetu, ustalony dla danego roku (wskaźnik jednoroczny)","Wskaźnik dochodów bieżących powiększonych o dochody ze sprzedaży majątku oraz pomniejszonych o wydatki bieżące, do dochodów budżetu, ustalony dla danego roku (wskaźnik jednoroczny)",{"$f":"+IF(AND(E9>=2013,E9<=2018),IF(E10<>0,(E11+E19-E22+E25)/E10,0),IF(E10<>0,(E11+E19-E22)/E10,0))","v":0.26125200296942935},0.20381654855811104,0.16069418610789521,0.15659642331723575,0.21102710960051613,0.26390370315588996,0.25871516168991798,0.25031054415108217]
["x","9.6","Dopuszczalny wskaźnik spłaty zobowiązań z art. 243 ustawy, po uwzględnieniu ustawowych wyłączeń (planistyczny) ","Dopuszczalny wskaźnik spłaty zobowiązań określony w art. 243 ustawy, po uwzględnieniu ustawowych wyłączeń , obliczony w oparciu o plan 3 kwartału roku poprzedzającego pierwszy rok prognozy (wskaźnik ustalony w oparciu o średnią arytmetyczną z 3 poprzednich lat) ","x","x","x","x",{"$f":"0.2086","v":0.20860000000000001},{"$f":"0.1918","v":0.1918},{"$f":"0.2119","v":0.21190000000000001},{"$f":"0.2445","v":0.2445}]
["x","9.6.1","Dopuszczalny wskaźnik spłaty zobowiązań z art. 243 ustawy, po uwzględnieniu ustawowych wyłączeń (wykonanie) ","Dopuszczalny wskaźnik spłaty zobowiązań określony w art. 243 ustawy, po uwzględnieniu ustawowych wyłączeń, obliczony w oparciu o wykonanie roku poprzedzającego pierwszy rok prognozy (wskaźnik ustalony w oparciu o średnią arytmetyczną z 3 poprzednich lat) ","x","x","x","x",{"$f":"0.2072","v":0.2072},{"$f":"0.1905","v":0.1905},{"$f":"0.2105","v":0.21049999999999999},{"$f":"0.2445","v":0.2445}]
["x","9.7"," Informacja o spełnieniu wskaźnika spłaty zobowiązań określonego w art. 243 ustawy, po uwzględnieniu zobowiązań związku współtworzonego przez jednostkę samorządu terytorialnego oraz po uwzględnieniu ustawowych wyłączeń, obliczonego w oparciu o plan 3 kwartałów roku poprzedzającego rok budżetowy","Informacja o spełnieniu wskaźnika spłaty zobowiązań określonego w art. 243 ustawy, po uwzględnieniu zobowiązań związku współtworzonego przez jednostkę samorządu terytorialnego oraz po uwzględnieniu ustawowych wyłączeń, obliczonego w oparciu o plan 3 kwartałów roku poprzedzającego rok budżetowy","x","x","x","x",{"$f":"IF(I57<=I59,\"Spełniona\",\"Nie spełniona\")","v":"Spełniona"},{"$f":"IF(J57<=J59,\"Spełniona\",\"Nie spełniona\")","v":"Spełniona"},{"$f":"IF(K57<=K59,\"Spełniona\",\"Nie spełniona\")","v":"Spełniona"},{"$f":"IF(L57<=L59,\"Spełniona\",\"Nie spełniona\")","v":"Spełniona"}]
["x","9.7.1","  Informacja o spełnieniu wskaźnika spłaty zobowiązań określonego w art. 243 ustawy, po uwzględnieniu zobowiązań związku współtworzonego przez jednostkę samorządu terytorialnego oraz po uwzględnieniu ustawowych wyłączeń, obliczonego w oparciu o wykonanie roku poprzedzającego rok budżetowy","Informacja o spełnieniu wskaźnika spłaty zobowiązań określonego w art. 243 ustawy, po uwzględnieniu zobowiązań związku współtworzonego przez jednostkę samorządu terytorialnego oraz po uwzględnieniu ustawowych wyłączeń, obliczonego w oparciu o wykonanie roku poprzedzającego rok budżetowy","x","x","x","x",{"$f":"IF(I57<=I60,\"Spełniona\",\"Nie spełniona\")","v":"Spełniona"},{"$f":"IF(J57<=J60,\"Spełniona\",\"Nie spełniona\")","v":"Spełniona"},{"$f":"IF(K57<=K60,\"Spełniona\",\"Nie spełniona\")","v":"Spełniona"},{"$f":"IF(L57<=L60,\"Spełniona\",\"Nie spełniona\")","v":"Spełniona"}]
[null,10,"Przeznaczenie prognozowanej nadwyżki budżetowej,  w tym na:","Przeznaczenie prognozowanej nadwyżki budżetowej,  w tym na:",{"$f":"0","v":0},{"$f":"0","v":0},{"$f":"0","v":0},{"$f":"0","v":0},{"$f":"0","v":0},{"$f":"701400","v":701400},{"$f":"701387.6","v":701387.6},{"$f":"0","v":0}]
[null,"10.1"," Spłaty kredytów, pożyczek i wykup papierów wartościowych","Spłaty kredytów, pożyczek i wykup papierów wartościowych",{"$f":"0","v":0},{"$f":"0","v":0},{"$f":"102313.19","v":102313.19},{"$f":"87813.19","v":87813.19},{"$f":"0","v":0},{"$f":"701400","v":701400},{"$f":"701387.6","v":701387.6},{"$f":"0","v":0}]
[null,11,"Informacje uzupełniające o wybranych rodzajach wydatków budżetowych","Informacje uzupełniające o wybranych rodzajach wydatków budżetowych","x","x","x","x","x","x","x","x"]
[null,"11.1"," Wydatki bieżące na wynagrodzenia i składki od nich naliczane","Wydatki bieżące na wynagrodzenia i składki od nich naliczane",{"$f":"4171528.09","v":4171528.09},{"$f":"4149289.86","v":4149289.86},{"$f":"4357418.68","v":4357418.68},{"$f":"4359798.43","v":4359798.43},{"$f":"4417511","v":4417511},{"$f":"4519114","v":4519114},{"$f":"4614015","v":4614015},{"$f":"4729365","v":4729365}]
[null,"11.2"," Wydatki związane z funkcjonowaniem organów jednostki samorządu terytorialnego","Wydatki związane z funkcjonowaniem organów jednostki samorządu terytorialnego",{"$f":"1438877.18","v":1438877.18},{"$f":"1343112.1","v":1343112.1},{"$f":"1571198","v":1571198},{"$f":"1571198","v":1571198},{"$f":"1539639","v":1539639},{"$f":"1575050","v":1575050},{"$f":"1608127","v":1608127},{"$f":"1648330","v":1648330}]
[null,"11.3"," Wydatki objęte limitem, o którym mowa w art. 226 ust. 3 pkt 4 ustawy","Wydatki objęte limitem, o którym mowa w art. 226 ust. 3 pkt 4 ustawy",{"$f":"718974.51","v":718974.51},{"$f":"3319528.6","v":3319528.6},{"$f":"352571.38","v":352571.38},{"$f":"352571.38","v":352571.38},{"$f":"945000","v":945000},{"$f":"1405000","v":1405000},{"$f":"0","v":0},{"$f":"0","v":0}]
[null,"11.3.1","   Wydatki bieżące na przedsięwzięcia","bieżące",{"$f":"156869.11","v":156869.10999999999},{"$f":"138833.24","v":138833.24},{"$f":"227234.31","v":227234.31},{"$f":"227234.31","v":227234.31},{"$f":"0","v":0},{"$f":"0","v":0},{"$f":"0","v":0},{"$f":"0","v":0}]
[null,"11.3.2","   Wydatki majątkowe na przedsięwzięcia","majątkowe",{"$f":"562105.4","v":562105.4},{"$f":"3180695.36","v":3180695.36},{"$f":"125337.07","v":125337.07},{"$f":"125337.07","v":125337.07},{"$f":"945000","v":945000},{"$f":"1405000","v":1405000},{"$f":"0","v":0},{"$f":"0","v":0}]
[null,"11.4"," Wydatki inwestycyjne kontynuowane ","Wydatki inwestycyjne kontynuowane ",{"$f":"835040.96","v":835040.96},{"$f":"3180695.36","v":3180695.36},{"$f":"0","v":0},{"$f":"0","v":0},{"$f":"850000","v":850000},{"$f":"1405000","v":1405000},{"$f":"0","v":0},{"$f":"0","v":0}]
[null,"11.5"," Nowe wydatki inwestycyjne","Nowe wydatki inwestycyjne",{"$f":"1590835.04","v":1590835.04},{"$f":"1184793.34","v":1184793.3400000001},{"$f":"4779247.07","v":4779247.07},{"$f":"4782647.07","v":4782647.07},{"$f":"2899615","v":2899615},{"$f":"1354990","v":1354990},{"$f":"2725882","v":2725882},{"$f":"3349090","v":3349090}]
[null,"11.6"," Wydatki majątkowe w formie dotacji ","Wydatki majątkowe w formie dotacji ",{"$f":"0","v":0},{"$f":"27700","v":27700},{"$f":"205000","v":205000},{"$f":"205000","v":205000},{"$f":"0","v":0},{"$f":"0","v":0},{"$f":"0","v":0},{"$f":"0","v":0}]
[null,12,"Finansowanie programów, projektów lub zadań realizowanych z udziałem środków, o których mowa w art. 5 ust. 1 pkt 2 i 3 ustawy","Finansowanie programów, projektów lub zadań realizowanych z udziałem środków, o których mowa w art. 5 ust. 1 pkt 2 i 3 ustawy","x","x","x","x","x","x","x","x"]
[null,"12.1"," Dochody bieżące  na programy, projekty lub zadania finansowane z udziałem środków, o których mowa w art. 5 ust. 1 pkt 2 i 3 ustawy","Dochody bieżące  na programy, projekty lub zadania finansowane z udziałem środków, o których mowa w art. 5 ust. 1 pkt 2 i 3 ustawy",{"$f":"179911.06","v":179911.06},{"$f":"105623.85","v":105623.85},{"$f":"220846.25","v":220846.25},{"$f":"220846.25","v":220846.25},{"$f":"0","v":0},{"$f":"0","v":0},{"$f":"0","v":0},{"$f":"0","v":0}]
[null,"12.1.1","  -  w tym środki określone w art. 5 ust. 1 pkt 2 ustawy","-  w tym środki określone w art. 5 ust. 1 pkt 2 ustawy",{"$f":"160689","v":160689},{"$f":"93191.67","v":93191.67},{"$f":"193149.17","v":193149.17},{"$f":"193149.17","v":193149.17},{"$f":"0","v":0},{"$f":"0","v":0},{"$f":"0","v":0},{"$f":"0","v":0}]
[null,"12.1.1.1","   - w tym środki określone w art. 5 ust. 1 pkt 2 ustawy wynikające wyłącznie z  zawartych umów na realizację programu, projektu lub zadania","- w tym środki określone w art. 5 ust. 1 pkt 2 ustawy wynikające wyłącznie z  zawartych umów na realizację programu, projektu lub zadania",{"$f":"0","v":0},{"$f":"93191.67","v":93191.67},{"$f":"193149.17","v":193149.17},{"$f":"193149.17","v":193149.17},{"$f":"0","v":0},{"$f":"0","v":0},{"$f":"0","v":0},{"$f":"0","v":0}]
[null,"12.2"," Dochody majątkowe  na programy, projekty lub zadania finansowane z udziałem środków, o których mowa w art. 5 ust. 1 pkt 2 i 3 ustawy","Dochody majątkowe  na programy, projekty lub zadania finansowane z udziałem środków, o których mowa w art. 5 ust. 1 pkt 2 i 3 ustawy",{"$f":"1013324.7","v":1013324.7},{"$f":"478204.67","v":478204.67},{"$f":"2251441.07","v":2251441.0699999998},{"$f":"2251441.07","v":2251441.0699999998},{"$f":"7900","v":7900},{"$f":"0","v":0},{"$f":"0","v":0},{"$f":"0","v":0}]
[null,"12.2.1","   -  w tym środki określone w art. 5 ust. 1 pkt 2 ustawy","-  w tym środki określone w art. 5 ust. 1 pkt 2 ustawy",{"$f":"826032","v":826032},{"$f":"232601.81","v":232601.81},{"$f":"2195185.51","v":2195185.5099999998},{"$f":"2195185.51","v":2195185.5099999998},{"$f":"0","v":0},{"$f":"0","v":0},{"$f":"0","v":0},{"$f":"0","v":0}]
[null,"12.2.1.1","    - w tym środki określone w art. 5 ust. 1 pkt 2 ustawy wynikające wyłącznie z zawartych umów na realizację programu, projektu lub zadania","- w tym środki określone w art. 5 ust. 1 pkt 2 ustawy wynikające wyłącznie z zawartych umów na realizację programu, projektu lub zadania",{"$f":"0","v":0},{"$f":"232601.81","v":232601.81},{"$f":"2195185.51","v":2195185.5099999998},{"$f":"2195185.51","v":2195185.5099999998},{"$f":"0","v":0},{"$f":"0","v":0},{"$f":"0","v":0},{"$f":"0","v":0}]
[null,"12.3"," Wydatki bieżące na programy, projekty lub zadania finansowane z udziałem środków, o których mowa w art. 5 ust. 1 pkt 2 i 3 ustawy","Wydatki bieżące na programy, projekty lub zadania finansowane z udziałem środków, o których mowa w art. 5 ust. 1 pkt 2 i 3 ustawy",{"$f":"156869.11","v":156869.10999999999},{"$f":"138833.24","v":138833.24},{"$f":"227234.31","v":227234.31},{"$f":"227234.31","v":227234.31},{"$f":"0","v":0},{"$f":"0","v":0},{"$f":"0","v":0},{"$f":"0","v":0}]
[null,"12.3.1","  -  w tym finansowane środkami określonymi w art. 5 ust. 1 pkt 2 ustawy ","-  w tym finansowane środkami określonymi w art. 5 ust. 1 pkt 2 ustawy ",{"$f":"133542.58","v":133542.57999999999},{"$f":"120259.63","v":120259.63},{"$f":"193149.17","v":193149.17},{"$f":"193149.17","v":193149.17},{"$f":"0","v":0},{"$f":"0","v":0},{"$f":"0","v":0},{"$f":"0","v":0}]
[null,"12.3.2","  Wydatki bieżące na realizację programu, projektu lub zadania wynikające wyłącznie z zawartych umów z podmiotem dysponującym środkami, o których mowa w art. 5 ust. 1 pkt 2 ustawy ","Wydatki bieżące na realizację programu, projektu lub zadania wynikające wyłącznie z zawartych umów z podmiotem dysponującym środkami, o których mowa w art. 5 ust. 1 pkt 2 ustawy ",{"$f":"0","v":0},{"$f":"138833.24","v":138833.24},{"$f":"227234.31","v":227234.31},{"$f":"227234.31","v":227234.31},{"$f":"0","v":0},{"$f":"0","v":0},{"$f":"0","v":0},{"$f":"0","v":0}]
[null,"12.4"," Wydatki majątkowe na programy, projekty lub zadania finansowane z udziałem środków, o których mowa w art. 5 ust. 1 pkt 2 i 3 ustawy","Wydatki majątkowe na programy, projekty lub zadania finansowane z udziałem środków, o których mowa w art. 5 ust. 1 pkt 2 i 3 ustawy",{"$f":"562105.4","v":562105.4},{"$f":"3180695.36","v":3180695.36},{"$f":"95037.07","v":95037.07},{"$f":"95037.07","v":95037.07},{"$f":"0","v":0},{"$f":"0","v":0},{"$f":"0","v":0},{"$f":"0","v":0}]
[null,"12.4.1","  -  w tym finansowane środkami określonymi w art. 5 ust. 1 pkt 2 ustawy","-  w tym finansowane środkami określonymi w art. 5 ust. 1 pkt 2 ustawy",{"$f":"220814.52","v":220814.52},{"$f":"3180695.36","v":3180695.36},{"$f":"80781.51","v":80781.509999999995},{"$f":"80781.51","v":80781.509999999995},{"$f":"0","v":0},{"$f":"0","v":0},{"$f":"0","v":0},{"$f":"0","v":0}]
[null,"12.4.2","  Wydatki majątkowe na realizację programu, projektu lub zadania wynikające wyłącznie z zawartych umów z podmiotem dysponującym środkami, o których mowa w art. 5 ust. 1 pkt 2 ustawy ","Wydatki majątkowe na realizację programu, projektu lub zadania wynikające wyłącznie z zawartych umów z podmiotem dysponującym środkami, o których mowa w art. 5 ust. 1 pkt 2 ustawy ",{"$f":"0","v":0},{"$f":"2074095.36","v":2074095.36},{"$f":"0","v":0},{"$f":"0","v":0},{"$f":"0","v":0},{"$f":"0","v":0},{"$f":"0","v":0},{"$f":"0","v":0}]
[null,"12.5"," Wydatki na wkład krajowy w związku z umową na realizację programu, projektu lub zadania finansowanego z udziałem środków, o których mowa w art. 5 ust. 1 pkt 2 ustawy bez względu na stopień finansowania tymi środkami ","Wydatki na wkład krajowy w związku z umową na realizację programu, projektu lub zadania finansowanego z udziałem środków, o których mowa w art. 5 ust. 1 pkt 2 ustawy bez względu na stopień finansowania tymi środkami ",{"$f":"0","v":0},{"$f":"0","v":0},{"$f":"0","v":0},{"$f":"0","v":0},{"$f":"0","v":0},{"$f":"0","v":0},{"$f":"0","v":0},{"$f":"0","v":0}]
[null,"12.5.1","  w tym w związku z już zawartą umową na realizację programu, projektu lub zadania","w tym w związku z już zawartą umową na realizację programu, projektu lub zadania",{"$f":"0","v":0},{"$f":"0","v":0},{"$f":"0","v":0},{"$f":"0","v":0},{"$f":"0","v":0},{"$f":"0","v":0},{"$f":"0","v":0},{"$f":"0","v":0}]
[null,"12.6"," Wydatki na wkład krajowy w związku z zawartą po dniu 1 stycznia 2013 r. umową na realizację programu, projektu lub zadania finansowanego w co najmniej 60% środkami, o których mowa w art. 5 ust. 1 pkt 2 ustawy","Wydatki na wkład krajowy w związku z zawartą po dniu 1 stycznia 2013 r. umową na realizację programu, projektu lub zadania finansowanego w co najmniej 60% środkami, o których mowa w art. 5 ust. 1 pkt 2 ustawy",{"$f":"0","v":0},{"$f":"0","v":0},{"$f":"0","v":0},{"$f":"0","v":0},{"$f":"0","v":0},{"$f":"0","v":0},{"$f":"0","v":0},{"$f":"0","v":0}]
[null,"12.6.1","  w tym w związku z już zawartą umową na realizację programu, projektu lub zadania","w tym w związku z już zawartą umową na realizację programu, projektu lub zadania",{"$f":"0","v":0},{"$f":"0","v":0},{"$f":"0","v":0},{"$f":"0","v":0},{"$f":"0","v":0},{"$f":"0","v":0},{"$f":"0","v":0},{"$f":"0","v":0}]
[null,"12.7"," Przychody z tytułu kredytów, pożyczek, emisji papierów wartościowych powstające w związku z umową na realizację programu, projektu lub zadania finansowanego z udziałem środków, o których mowa w art. 5 ust. 1 pkt 2 ustawy bez względu na stopień finansowania tymi środkami ","Przychody z tytułu kredytów, pożyczek, emisji papierów wartościowych powstające w związku z umową na realizację programu, projektu lub zadania finansowanego z udziałem środków, o których mowa w art. 5 ust. 1 pkt 2 ustawy bez względu na stopień finansowania tymi środkami ",{"$f":"0","v":0},{"$f":"0","v":0},{"$f":"0","v":0},{"$f":"0","v":0},{"$f":"0","v":0},{"$f":"0","v":0},{"$f":"0","v":0},{"$f":"0","v":0}]
[null,"12.7.1","  w tym w związku z już zawartą umową na realizację programu, projektu lub zadania","w tym w związku z już zawartą umową na realizację programu, projektu lub zadania",{"$f":"0","v":0},{"$f":"0","v":0},{"$f":"0","v":0},{"$f":"0","v":0},{"$f":"0","v":0},{"$f":"0","v":0},{"$f":"0","v":0},{"$f":"0","v":0}]
[null,"12.8"," Przychody z tytułu kredytów, pożyczek, emisji papierów wartościowych powstające w związku z zawartą po dniu 1 stycznia 2013 r. umową na realizację programu, projektu lub zadania finansowanego w co najmniej 60% środkami, o których mowa w art. 5 ust. 1 pkt 2 ustawy","Przychody z tytułu kredytów, pożyczek, emisji papierów wartościowych powstające w związku z zawartą po dniu 1 stycznia 2013 r. umową na realizację programu, projektu lub zadania finansowanego w co najmniej 60% środkami, o których mowa w art. 5 ust. 1 pkt 2 ustawy",{"$f":"0","v":0},{"$f":"0","v":0},{"$f":"0","v":0},{"$f":"0","v":0},{"$f":"0","v":0},{"$f":"0","v":0},{"$f":"0","v":0},{"$f":"0","v":0}]
[null,"12.8.1","  w tym w związku z już zawartą umową na realizację programu, projektu lub zadania","w tym w związku z już zawartą umową na realizację programu, projektu lub zadania",{"$f":"0","v":0},{"$f":"0","v":0},{"$f":"0","v":0},{"$f":"0","v":0},{"$f":"0","v":0},{"$f":"0","v":0},{"$f":"0","v":0},{"$f":"0","v":0}]
[null,13,"Kwoty dotyczące przejęcia i spłaty zobowiązań po samodzielnych publicznych zakładach opieki zdrowotnej oraz pokrycia ujemnego wyniku ","Kwoty dotyczące przejęcia i spłaty zobowiązań po samodzielnych publicznych zakładach opieki zdrowotnej oraz pokrycia ujemnego wyniku ","x","x","x","x","x","x","x","x"]
[null,"13.1"," Kwota zobowiązań wynikających z przejęcia przez jednostkę samorządu terytorialnego zobowiązań po likwidowanych i przekształcanych samodzielnych zakładach opieki zdrowotnej","Kwota zobowiązań wynikających z przejęcia przez jednostkę samorządu terytorialnego zobowiązań po likwidowanych i przekształcanych samodzielnych zakładach opieki zdrowotnej",{"$f":"0","v":0},{"$f":"0","v":0},{"$f":"0","v":0},{"$f":"0","v":0},{"$f":"0","v":0},{"$f":"0","v":0},{"$f":"0","v":0},{"$f":"0","v":0}]
[null,"13.2"," Dochody budżetowe z tytułu dotacji celowej z budżetu państwa, o której mowa w art. 196 ustawy z  dnia 15 kwietnia 2011 r.  o działalności leczniczej (Dz.U. Nr 112, poz. 654, z późn. zm.)","Dochody budżetowe z tytułu dotacji celowej z budżetu państwa, o której mowa w art. 196 ustawy z  dnia 15 kwietnia 2011 r.  o działalności leczniczej (Dz.U. Nr 112, poz. 654, z późn. zm.)",{"$f":"0","v":0},{"$f":"0","v":0},{"$f":"0","v":0},{"$f":"0","v":0},{"$f":"0","v":0},{"$f":"0","v":0},{"$f":"0","v":0},{"$f":"0","v":0}]
[null,"13.3"," Wysokość zobowiązań podlegających umorzeniu, o którym mowa w art. 190 ustawy o działalności leczniczej","Wysokość zobowiązań podlegających umorzeniu, o którym mowa w art. 190 ustawy o działalności leczniczej",{"$f":"0","v":0},{"$f":"0","v":0},{"$f":"0","v":0},{"$f":"0","v":0},{"$f":"0","v":0},{"$f":"0","v":0},{"$f":"0","v":0},{"$f":"0","v":0}]
[null,"13.4"," Wydatki na spłatę przejętych zobowiązań samodzielnego publicznego zakładu opieki zdrowotnej przekształconego na zasadach określonych w przepisach  o działalności leczniczej","Wydatki na spłatę przejętych zobowiązań samodzielnego publicznego zakładu opieki zdrowotnej przekształconego na zasadach określonych w przepisach  o działalności leczniczej",{"$f":"0","v":0},{"$f":"0","v":0},{"$f":"0","v":0},{"$f":"0","v":0},{"$f":"0","v":0},{"$f":"0","v":0},{"$f":"0","v":0},{"$f":"0","v":0}]
[null,"13.5"," Wydatki na spłatę przejętych zobowiązań samodzielnego publicznego zakładu opieki zdrowotnej likwidowanego na zasadach określonych w przepisach  o działalności leczniczej","Wydatki na spłatę przejętych zobowiązań samodzielnego publicznego zakładu opieki zdrowotnej likwidowanego na zasadach określonych w przepisach  o działalności leczniczej",{"$f":"0","v":0},{"$f":"0","v":0},{"$f":"0","v":0},{"$f":"0","v":0},{"$f":"0","v":0},{"$f":"0","v":0},{"$f":"0","v":0},{"$f":"0","v":0}]
[null,"13.6"," Wydatki na spłatę zobowiązań samodzielnego publicznego zakładu opieki zdrowotnej przejętych do końca 2011 r. na podstawie przepisów o zakładach opieki zdrowotnej","Wydatki na spłatę zobowiązań samodzielnego publicznego zakładu opieki zdrowotnej przejętych do końca 2011 r. na podstawie przepisów o zakładach opieki zdrowotnej",{"$f":"0","v":0},{"$f":"0","v":0},{"$f":"0","v":0},{"$f":"0","v":0},{"$f":"0","v":0},{"$f":"0","v":0},{"$f":"0","v":0},{"$f":"0","v":0}]
[null,"13.7"," Wydatki bieżące na pokrycie ujemnego wyniku finansowego samodzielnego publicznego zakładu opieki zdrowotnej","Wydatki bieżące na pokrycie ujemnego wyniku finansowego samodzielnego publicznego zakładu opieki zdrowotnej",{"$f":"0","v":0},{"$f":"0","v":0},{"$f":"0","v":0},{"$f":"0","v":0},{"$f":"0","v":0},{"$f":"0","v":0},{"$f":"0","v":0},{"$f":"0","v":0}]
["x",14,"Dane uzupełniające o długu i jego spłacie","Dane uzupełniające o długu i jego spłacie","x","x","x","x","x","x","x","x"]
["x","14.1"," Spłaty rat kapitałowych oraz wykup papierów wartościowych, o których mowa w pkt. 5.1., wynikające wyłącznie z tytułu zobowiązań już zaciągniętych","Spłaty rat kapitałowych oraz wykup papierów wartościowych, o których mowa w pkt. 5.1., wynikające wyłącznie z tytułu zobowiązań już zaciągniętych",{"$f":"1278520.75","v":1278520.75},{"$f":"737521.46","v":737521.46},{"$f":"773956.19","v":773956.19},{"$f":"604776.59","v":604776.59},{"$f":"169179.6","v":169179.6},{"$f":"701400","v":701400},{"$f":"701387.6","v":701387.6},{"$f":"0","v":0}]
["x","14.2"," Kwota długu, którego planowana spłata dokona się z wydatków budżetu","Kwota długu, którego planowana spłata dokona się z wydatków budżetu",{"$f":"0","v":0},{"$f":"0","v":0},{"$f":"0","v":0},{"$f":"0","v":0},{"$f":"0","v":0},{"$f":"0","v":0},{"$f":"0","v":0},{"$f":"0","v":0}]
["x","14.3"," Wydatki zmniejszające dług, w tym","Wydatki zmniejszające dług, w tym",{"$f":"0","v":0},{"$f":"0","v":0},{"$f":"0","v":0},{"$f":"0","v":0},{"$f":"0","v":0},{"$f":"0","v":0},{"$f":"0","v":0},{"$f":"0","v":0}]
["x","14.3.1","  spłata zobowiązań wymagalnych z lat poprzednich, innych niż w pkt 14.3.3","spłata zobowiązań wymagalnych z lat poprzednich, innych niż w pkt 14.3.3",{"$f":"0","v":0},{"$f":"0","v":0},{"$f":"0","v":0},{"$f":"0","v":0},{"$f":"0","v":0},{"$f":"0","v":0},{"$f":"0","v":0},{"$f":"0","v":0}]
["x","14.3.2","  związane z umowami zaliczanymi do tytułów dłużnych wliczanych do państwowego długu publicznego","związane z umowami zaliczanymi do tytułów dłużnych wliczanych do państwowego długu publicznego",{"$f":"0","v":0},{"$f":"0","v":0},{"$f":"0","v":0},{"$f":"0","v":0},{"$f":"0","v":0},{"$f":"0","v":0},{"$f":"0","v":0},{"$f":"0","v":0}]
["x","14.3.3","  wypłaty z tytułu wymagalnych poręczeń i gwarancji","wypłaty z tytułu wymagalnych poręczeń i gwarancji",{"$f":"0","v":0},{"$f":"0","v":0},{"$f":"0","v":0},{"$f":"0","v":0},{"$f":"0","v":0},{"$f":"0","v":0},{"$f":"0","v":0},{"$f":"0","v":0}]
["x","14.4"," Wynik operacji niekasowych wpływających na kwotę długu ( m.in. umorzenia, różnice kursowe)","Wynik operacji niekasowych wpływających na kwotę długu ( m.in. umorzenia, różnice kursowe)",{"$f":"0","v":0},{"$f":"0","v":0},{"$f":"0","v":0},{"$f":"0","v":0},{"$f":"0","v":0},{"$f":"0","v":0},{"$f":"0","v":0},{"$f":"0","v":0}]
[null,15,"Dane dotyczące emitowanych obligacji przychodowych","Dane dotyczące emitowanych obligacji przychodowych","x","x","x","x","x","x","x","x"]
[null,"15.1"," Środki z przedsięwzięcia gromadzone na rachunku bankowym,  w tym:","Środki z przedsięwzięcia gromadzone na rachunku bankowym,  w tym:",{"$f":"0","v":0},{"$f":"0","v":0},{"$f":"0","v":0},{"$f":"0","v":0},{"$f":"0","v":0},{"$f":"0","v":0},{"$f":"0","v":0},{"$f":"0","v":0}]
["x","15.1.1","  środki na zaspokojenie roszczeń obligatariuszy","środki na zaspokojenie roszczeń obligatariuszy",{"$f":"0","v":0},{"$f":"0","v":0},{"$f":"0","v":0},{"$f":"0","v":0},{"$f":"0","v":0},{"$f":"0","v":0},{"$f":"0","v":0},{"$f":"0","v":0}]
["x","15.2","Wydatki bieżące z tytułu świadczenia emitenta należnego obligatariuszom,  nieuwzględniane  w limicie spłaty zobowiązań, o którym mowa w art. 243 ustawy","Wydatki bieżące z tytułu świadczenia emitenta należnego obligatariuszom,  nieuwzględniane  w limicie spłaty zobowiązań, o którym mowa w art. 243 ustawy",{"$f":"0","v":0},{"$f":"0","v":0},{"$f":"0","v":0},{"$f":"0","v":0},{"$f":"0","v":0},{"$f":"0","v":0},{"$f":"0","v":0},{"$f":"0","v":0}]
[null,16,null,"Stopień niezachowania relacji określonych w art. 242-244 ustawy \n(dotyczy tylko JST objętych procedurą z art. 240a lub 240b)","x","x","x","x","x","x","x","x"]
[null,"16.1",null,"Stopień niezachowania relacji zrównoważenia wydatków bieżących, o której mowa w poz. 8.2","x","x","x","x",{"$f":"+IF(I52<0,I52,\"\")","v":""},{"$f":"+IF(J52<0,J52,\"\")","v":""},{"$f":"+IF(K52<0,K52,\"\")","v":""},{"$f":"+IF(L52<0,L52,\"\")","v":""}]
["x","16.2",null,"Stopień niezachowania wskaźnika spłaty zobowiązań, o którym mowa w poz. 9.7","x","x","x","x",{"$f":"IF(I57<=I59,\"\",I59- I57)","v":""},{"$f":"IF(J57<=J59,\"\",J59- J57)","v":""},{"$f":"IF(K57<=K59,\"\",K59- K57)","v":""},{"$f":"IF(L57<=L59,\"\",L59- L57)","v":""}]
["x","16.3",null,"Stopień niezachowania wskaźnika spłaty zobowiązań, o którym mowa w poz. 9.7.1","x","x","x","x",{"$f":"IF(I57<=I60,\"\",I60-I57)","v":""},{"$f":"IF(J57<=J60,\"\",J60-J57)","v":""},{"$f":"IF(K57<=K60,\"\",K60-K57)","v":""},{"$f":"IF(L57<=L60,\"\",L60-L57)","v":""}]
[]
[null,"UWAGA!"]
[null,"Do symulacji prognozy i obserwacji zmian relacji z art. 242-243 na podstawie danych wprowadzanych ręcznie służy arkusz \"WPF_AnalizaWsk_Projektowanie\""]
[]
[]
[null,"Weryfikacja wybranych danych wykazanych w tabeli Wieloletnia Prognoza Finansowa"]
[null,null,null,"Reguła formalna"]
[null,null,null,"Reguła rachunkowa"]
[null,null,null,"Reguła logiczna"]
[null,null,null,"Reguły kontrolne"]
[null,"[1.1] + [4.1] + [4.2] >= ([2.1] - [2.1.2])","[1.1] + [4.1] + [4.2] >= ([2.1] - [2.1.2])","Spełnienie wskaźnika z art. 242","x","x","x","x",{"$f":"IF(ROUND(I11+I33+I35,2)>=ROUND(I22-I25,2),\"TAK\",\"NIE\")","v":"TAK"},{"$f":"IF(ROUND(J11+J33+J35,2)>=ROUND(J22-J25,2),\"TAK\",\"NIE\")","v":"TAK"},{"$f":"IF(ROUND(K11+K33+K35,2)>=ROUND(K22-K25,2),\"TAK\",\"NIE\")","v":"TAK"},{"$f":"IF(ROUND(L11+L33+L35,2)>=ROUND(L22-L25,2),\"TAK\",\"NIE\")","v":"TAK"}]
[null,"[13.3] = 0 (dla lat 2014 i wyższych)","[13.3] = 0 (dla lat 2014 i wyższych)","Umorzenie zobowiązań, o którym mowa w art. 190 ustawy o działalności leczniczej nie wykracza poza ustawowy okres","x","x","x","x","x","x",{"$f":"IF(K98=0,\"TAK\",\"BŁĄD\")","v":"TAK"},{"$f":"IF(L98=0,\"TAK\",\"BŁĄD\")","v":"TAK"}]
[null,"[1] + [4] - [2] - [5] = 0","[1] + [4] - [2] - [5] = 0","Kontrola poprawności zbilansowania budżetu","x","x","x","x",{"$f":"IF(ROUND(I10+I32-I21-I41,2)=0,\"OK\",ROUND(I10+I32-I21-I41,2))","v":"OK"},{"$f":"IF(ROUND(J10+J32-J21-J41,2)=0,\"OK\",ROUND(J10+J32-J21-J41,2))","v":"OK"},{"$f":"IF(ROUND(K10+K32-K21-K41,2)=0,\"OK\",ROUND(K10+K32-K21-K41,2))","v":"OK"},{"$f":"IF(ROUND(L10+L32-L21-L41,2)=0,\"OK\",ROUND(L10+L32-L21-L41,2))","v":"OK"}]
[null,"[6]\"n\" = [6]\"n-1\" + [4.3]\"n\" - [5.1]\"n\" +  ([14.2]\"n\"-[14.2]\"n-1\") + [14.4]","[6]\"n\" = [6]\"n-1\" + [4.3]\"n\" - [5.1]\"n\" +  ([14.2]\"n\"-[14.2]\"n-1\") + [14.4]","Kontrola poprawności wyliczenia kwoty długu","x","x","x","x",{"$f":"+IF(ROUND(H48+I37-I42+(I105-H105)+I110-I48,2)=0,\"OK\",ROUND(H48+I37-I42+(I105-H105)+I110-I48,2))","v":"OK"},{"$f":"+IF(ROUND(I48+J37-J42+(J105-I105)+J110-J48,2)=0,\"OK\",ROUND(I48+J37-J42+(J105-I105)+J110-J48,2))","v":"OK"},{"$f":"+IF(ROUND(J48+K37-K42+(K105-J105)+K110-K48,2)=0,\"OK\",ROUND(J48+K37-K42+(K105-J105)+K110-K48,2))","v":"OK"},{"$f":"+IF(ROUND(K48+L37-L42+(L105-K105)+L110-L48,2)=0,\"OK\",ROUND(K48+L37-L42+(L105-K105)+L110-L48,2))","v":"OK"}]
[null,"[14.2] \"n\" =  ( [14.2]  \"n-1\" -  [14.3] \"n\" ) ","[14.2] \"n\" =  ( [14.2]  \"n-1\" -  [14.3] \"n\" ) ","Analiza zmiany kwoty długu spłacanego wydatkami budżetu \n- wartości różne od zera wymagają objaśnienia \n   - wartości większe od zera wskazują na powstanie w roku prognozy nowego długu tego typu\n   - wartości mniejsze od zera co do zasady nie powinny wystąpić","x","x","x","x",{"$f":"+IF(H105=0,\"N/D\",IF(ROUND(I105+I106-H105,2)=0,\"OK\",ROUND(I105+I106-H105,2)))","v":"N/D"},{"$f":"+IF(I105=0,\"N/D\",IF(ROUND(J105+J106-I105,2)=0,\"OK\",ROUND(J105+J106-I105,2)))","v":"N/D"},{"$f":"+IF(J105=0,\"N/D\",IF(ROUND(K105+K106-J105,2)=0,\"OK\",ROUND(K105+K106-J105,2)))","v":"N/D"},{"$f":"+IF(K105=0,\"N/D\",IF(ROUND(L105+L106-K105,2)=0,\"OK\",ROUND(L105+L106-K105,2)))","v":"N/D"}]
[null,"[13.1] \"n\"  -  ( [13.3] + [13.4] + [13.5] + [13.6] ) \"n\"  =  [13.1] \"n-1\"","[13.1] \"n\"  -  ( [13.3] + [13.4] + [13.5] + [13.6] ) \"n\"  =  [13.1] \"n-1\"","Porównanie na koniec roku prognozy stanu zobowiązań przejętych przez jst po likwidowanych i przekształcanych SP ZOZ z wydatkami i umorzeniami poniesionymi na ten cel ze stanem zobowiązań z okresu N-1","x","x","x","x",{"$f":"+IF(H96=0,\"N/D\",IF(ROUND(I96+(I98+I99+I100+I101)-H96,2)=0,\"OK\",ROUND(I96+(I98+I99+I100+I101)-H96,2)))","v":"N/D"},{"$f":"+IF(I96=0,\"N/D\",IF(ROUND(J96+(J98+J99+J100+J101)-I96,2)=0,\"OK\",ROUND(J96+(J98+J99+J100+J101)-I96,2)))","v":"N/D"},{"$f":"+IF(J96=0,\"N/D\",IF(ROUND(K96+(K98+K99+K100+K101)-J96,2)=0,\"OK\",ROUND(K96+(K98+K99+K100+K101)-J96,2)))","v":"N/D"},{"$f":"+IF(K96=0,\"N/D\",IF(ROUND(L96+(L98+L99+L100+L101)-K96,2)=0,\"OK\",ROUND(L96+(L98+L99+L100+L101)-K96,2)))","v":"N/D"}]
[null,"jeśli [3] < 0 to sprawdź czy [4.1.1] + [4.2.1] + [4.3.1] + [4.4.1] + [3] = 0","jeśli [3] < 0 to sprawdź czy [4.1.1] + [4.2.1] + [4.3.1] + [4.4.1] + [3] = 0","Kontrola poprawności wykazania źródeł pokrycia deficytu","x","x","x","x",{"$f":"IF(I31<0,IF(ROUND(I34+I36+I38+I40+I31,2)=0,\"OK\",ROUND(I34+I36+I38+I40+I31,2)),\"N/D\")","v":"OK"},{"$f":"IF(J31<0,IF(ROUND(J34+J36+J38+J40+J31,2)=0,\"OK\",ROUND(J34+J36+J38+J40+J31,2)),\"N/D\")","v":"N/D"},{"$f":"IF(K31<0,IF(ROUND(K34+K36+K38+K40+K31,2)=0,\"OK\",ROUND(K34+K36+K38+K40+K31,2)),\"N/D\")","v":"N/D"},{"$f":"IF(L31<0,IF(ROUND(L34+L36+L38+L40+L31,2)=0,\"OK\",ROUND(L34+L36+L38+L40+L31,2)),\"N/D\")","v":"N/D"}]
[null,"jeśli [3] >= 0 to sprawdź czy [4.1.1]=0 i [4.2.1]=0 i [4.3.1]=0 i  [4.4.1] = 0","jeśli [3] >= 0 to sprawdź czy [4.1.1]=0 i [4.2.1]=0 i [4.3.1]=0 i  [4.4.1] = 0","Kontrola poprawności niewykazania źródeł pokrycia deficytu przy nadwyżce budżetu","x","x","x","x",{"$f":"IF(I31>=0,IF(ROUND(I34+I36+I38+I40,2)=0,\"OK\",ROUND(I34+I36+I38+I40,2)),\"N/D\")","v":"N/D"},{"$f":"IF(J31>=0,IF(ROUND(J34+J36+J38+J40,2)=0,\"OK\",ROUND(J34+J36+J38+J40,2)),\"N/D\")","v":"OK"},{"$f":"IF(K31>=0,IF(ROUND(K34+K36+K38+K40,2)=0,\"OK\",ROUND(K34+K36+K38+K40,2)),\"N/D\")","v":"OK"},{"$f":"IF(L31>=0,IF(ROUND(L34+L36+L38+L40,2)=0,\"OK\",ROUND(L34+L36+L38+L40,2)),\"N/D\")","v":"OK"}]
[null,"[1.1.3] >=  [1.1.3.1]","[1.1.3] >=  [1.1.3.1]","Reguła logiczna:  [1.1.3] >=  [1.1.3.1]","x","x","x","x",{"$f":"IF(I14>=I15,\"OK\",\"BŁĄD\")","v":"OK"},{"$f":"IF(J14>=J15,\"OK\",\"BŁĄD\")","v":"OK"},{"$f":"IF(K14>=K15,\"OK\",\"BŁĄD\")","v":"OK"},{"$f":"IF(L14>=L15,\"OK\",\"BŁĄD\")","v":"OK"}]
[null,"[1.1.5] >= [13.2]","[1.1.5] >= [13.2]","Reguła logiczna:  [1.1.5] >= [13.2]","x","x","x","x",{"$f":"IF(I17>=I97,\"OK\",\"BŁĄD\")","v":"OK"},{"$f":"IF(J17>=J97,\"OK\",\"BŁĄD\")","v":"OK"},{"$f":"IF(K17>=K97,\"OK\",\"BŁĄD\")","v":"OK"},{"$f":"IF(L17>=L97,\"OK\",\"BŁĄD\")","v":"OK"}]
[null,"[1.1] >=  ([1.1.1] + [1.1.2] + [1.1.3] + [1.1.4] + [1.1.5])","[1.1] >=  ([1.1.1] + [1.1.2] + [1.1.3] + [1.1.4] + [1.1.5])","Reguła logiczna:  [1.1] >=  ([1.1.1] + [1.1.2] + [1.1.3] + [1.1.4] + [1.1.5])","x","x","x","x",{"$f":"IF(I11>=I12+I13+I14+I16+I17,\"OK\",\"BŁĄD\")","v":"OK"},{"$f":"IF(J11>=J12+J13+J14+J16+J17,\"OK\",\"BŁĄD\")","v":"OK"},{"$f":"IF(K11>=K12+K13+K14+K16+K17,\"OK\",\"BŁĄD\")","v":"OK"},{"$f":"IF(L11>=L12+L13+L14+L16+L17,\"OK\",\"BŁĄD\")","v":"OK"}]
[null,"[1.1] >= [12.1]","[1.1] >= [12.1]","Reguła logiczna:  [1.1] >= [12.1]","x","x","x","x",{"$f":"IF(I11>=I75,\"OK\",\"BŁĄD\")","v":"OK"},{"$f":"IF(J11>=J75,\"OK\",\"BŁĄD\")","v":"OK"},{"$f":"IF(K11>=K75,\"OK\",\"BŁĄD\")","v":"OK"},{"$f":"IF(L11>=L75,\"OK\",\"BŁĄD\")","v":"OK"}]
[null,"[1.2] >= [1.2.1]","[1.2] >= [1.2.1]","Reguła logiczna:  [1.2] >= [1.2.1]","x","x","x","x",{"$f":"IF(I18>=I19,\"OK\",\"BŁĄD\")","v":"OK"},{"$f":"IF(J18>=J19,\"OK\",\"BŁĄD\")","v":"OK"},{"$f":"IF(K18>=K19,\"OK\",\"BŁĄD\")","v":"OK"},{"$f":"IF(L18>=L19,\"OK\",\"BŁĄD\")","v":"OK"}]
[null,"[1.2] >= [1.2.2]","[1.2] >= [1.2.2]","Reguła logiczna:  [1.2] >= [1.2.2]","x","x","x","x",{"$f":"IF(I18>=I20,\"OK\",\"BŁĄD\")","v":"OK"},{"$f":"IF(J18>=J20,\"OK\",\"BŁĄD\")","v":"OK"},{"$f":"IF(K18>=K20,\"OK\",\"BŁĄD\")","v":"OK"},{"$f":"IF(L18>=L20,\"OK\",\"BŁĄD\")","v":"OK"}]
[null,"[1.2] >= [12.2]","[1.2] >= [12.2]","Reguła logiczna:  [1.2] >= [12.2]","x","x","x","x",{"$f":"IF(I18>=I78,\"OK\",\"BŁĄD\")","v":"OK"},{"$f":"IF(J18>=J78,\"OK\",\"BŁĄD\")","v":"OK"},{"$f":"IF(K18>=K78,\"OK\",\"BŁĄD\")","v":"OK"},{"$f":"IF(L18>=L78,\"OK\",\"BŁĄD\")","v":"OK"}]
[null,null,null,"Reguła logiczna: jeżeli [3] >0 to [10] = [3]","x","x","x","x",{"$f":"+IF(I31>0,IF(I31=I63,\"OK\",\"Błąd\"),\"N/D\")","v":"N/D"},{"$f":"+IF(J31>0,IF(J31=J63,\"OK\",\"Błąd\"),\"N/D\")","v":"OK"},{"$f":"+IF(K31>0,IF(K31=K63,\"OK\",\"Błąd\"),\"N/D\")","v":"OK"},{"$f":"+IF(L31>0,IF(L31=L63,\"OK\",\"Błąd\"),\"N/D\")","v":"N/D"}]
[null,"[10] >= [10.1]","[10] >= [10.1]","Reguła logiczna:  [10] >= [10.1]","x","x","x","x",{"$f":"IF(I63>=I64,\"OK\",\"BŁĄD\")","v":"OK"},{"$f":"IF(J63>=J64,\"OK\",\"BŁĄD\")","v":"OK"},{"$f":"IF(K63>=K64,\"OK\",\"BŁĄD\")","v":"OK"},{"$f":"IF(L63>=L64,\"OK\",\"BŁĄD\")","v":"OK"}]
[null,null,"jeśli [10] > 0 to powinno być [10.1] > 0","Reguła logiczna:  jeżeli [10] > 0 to [10.1] >0","x","x","x","x",{"$f":"IF(I63>0,IF(I64>0,\"OK\",\"BŁĄD\"),\"N/D\")","v":"N/D"},{"$f":"IF(J63>0,IF(J64>0,\"OK\",\"BŁĄD\"),\"N/D\")","v":"OK"},{"$f":"IF(K63>0,IF(K64>0,\"OK\",\"BŁĄD\"),\"N/D\")","v":"OK"},{"$f":"IF(L63>0,IF(L64>0,\"OK\",\"BŁĄD\"),\"N/D\")","v":"N/D"}]
[null,"[12.1] >= [12.1.1]","[12.1] >= [12.1.1]","Reguła logiczna:  [12.1] >= [12.1.1]","x","x","x","x",{"$f":"IF(I75>=I76,\"OK\",\"BŁĄD\")","v":"OK"},"OK","OK","OK"]
[null,"[12.1.1] >= [12.1.1.1]","[12.1.1] >= [12.1.1.1]","Reguła logiczna:  [12.1.1] >= [12.1.1.1]","x","x","x","x","OK","OK","OK","OK"]
[null,"[12.2] >= [12.2.1]","[12.2] >= [12.2.1]","Reguła logiczna:  [12.2] >= [12.2.1]","x","x","x","x",{"$f":"IF(I78>=I79,\"OK\",\"BŁĄD\")","v":"OK"},"OK","OK","OK"]
[null,"[12.2.1] >= [12.2.1.1]","[12.2.1] >= [12.2.1.1]","Reguła logiczna:  [12.2.1] >= [12.2.1.1]","x","x","x","x","OK","OK","OK","OK"]
[null,"[12.3] >= [12.3.1]","[12.3] >= [12.3.1]","Reguła logiczna:  [12.3] >= [12.3.1]","x","x","x","x",{"$f":"IF(I81>=I82,\"OK\",\"BŁĄD\")","v":"OK"},{"$f":"IF(J81>=J82,\"OK\",\"BŁĄD\")","v":"OK"},{"$f":"IF(K81>=K82,\"OK\",\"BŁĄD\")","v":"OK"},{"$f":"IF(L81>=L82,\"OK\",\"BŁĄD\")","v":"OK"}]
[null,"[12.3] >= [12.3.2]","[12.3] >= [12.3.2]","Reguła logiczna:  [12.3] >= [12.3.2]","x","x","x","x",{"$f":"IF(I81>=I83,\"OK\",\"BŁĄD\")","v":"OK"},{"$f":"IF(J81>=J83,\"OK\",\"BŁĄD\")","v":"OK"},{"$f":"IF(K81>=K83,\"OK\",\"BŁĄD\")","v":"OK"},{"$f":"IF(L81>=L83,\"OK\",\"BŁĄD\")","v":"OK"}]
[null,"[12.4] >= [12.4.1]","[12.4] >= [12.4.1]","Reguła logiczna:  [12.4] >= [12.4.1]","x","x","x","x",{"$f":"IF(I84>=I85,\"OK\",\"BŁĄD\")","v":"OK"},{"$f":"IF(J84>=J85,\"OK\",\"BŁĄD\")","v":"OK"},{"$f":"IF(K84>=K85,\"OK\",\"BŁĄD\")","v":"OK"},{"$f":"IF(L84>=L85,\"OK\",\"BŁĄD\")","v":"OK"}]
[null,"[12.4] >= [12.4.2]","[12.4] >= [12.4.2]","Reguła logiczna:  [12.4] >= [12.4.2]","x","x","x","x",{"$f":"IF(I84>=I86,\"OK\",\"BŁĄD\")","v":"OK"},{"$f":"IF(J84>=J86,\"OK\",\"BŁĄD\")","v":"OK"},{"$f":"IF(K84>=K86,\"OK\",\"BŁĄD\")","v":"OK"},{"$f":"IF(L84>=L86,\"OK\",\"BŁĄD\")","v":"OK"}]
[null,"[12.4] >= [12.4.1]","[12.4] >= [12.4.1]","Reguła logiczna:  [12.5] >= [12.5.1]","x","x","x","x",{"$f":"IF(I87>=I88,\"OK\",\"BŁĄD\")","v":"OK"},{"$f":"IF(J87>=J88,\"OK\",\"BŁĄD\")","v":"OK"},{"$f":"IF(K87>=K88,\"OK\",\"BŁĄD\")","v":"OK"},{"$f":"IF(L87>=L88,\"OK\",\"BŁĄD\")","v":"OK"}]
[null,"[12.4] >= [12.4.1]","[12.4] >= [12.4.1]","Reguła logiczna:  [12.6] >= [12.6.1]","x","x","x","x",{"$f":"IF(I89>=I90,\"OK\",\"BŁĄD\")","v":"OK"},{"$f":"IF(J89>=J90,\"OK\",\"BŁĄD\")","v":"OK"},{"$f":"IF(K89>=K90,\"OK\",\"BŁĄD\")","v":"OK"},{"$f":"IF(L89>=L90,\"OK\",\"BŁĄD\")","v":"OK"}]
[null,"[12.4] >= [12.4.1]","[12.4] >= [12.4.1]","Reguła logiczna:  [12.7] >= [12.7.1]","x","x","x","x",{"$f":"IF(I91>=I92,\"OK\",\"BŁĄD\")","v":"OK"},{"$f":"IF(J91>=J92,\"OK\",\"BŁĄD\")","v":"OK"},{"$f":"IF(K91>=K92,\"OK\",\"BŁĄD\")","v":"OK"},{"$f":"IF(L91>=L92,\"OK\",\"BŁĄD\")","v":"OK"}]
[null,"[12.4] >= [12.4.1]","[12.4] >= [12.4.1]","Reguła logiczna:  [12.8] >= [12.8.1]","x","x","x","x",{"$f":"IF(I93>=I94,\"OK\",\"BŁĄD\")","v":"OK"},{"$f":"IF(J93>=J94,\"OK\",\"BŁĄD\")","v":"OK"},{"$f":"IF(K93>=K94,\"OK\",\"BŁĄD\")","v":"OK"},{"$f":"IF(L93>=L94,\"OK\",\"BŁĄD\")","v":"OK"}]
[null,"[13.1] >= [13.3]","[13.1] >= [13.3]","Reguła logiczna:  [13.1] >= [13.3]","x","x","x","x",{"$f":"IF(I96>=I98,\"OK\",\"BŁĄD\")","v":"OK"},{"$f":"IF(J96>=J98,\"OK\",\"BŁĄD\")","v":"OK"},{"$f":"IF(K96>=K98,\"OK\",\"BŁĄD\")","v":"OK"},{"$f":"IF(L96>=L98,\"OK\",\"BŁĄD\")","v":"OK"}]
[null,"[13.4] >= [2.1.2]","[13.4] >= [2.1.2]","Reguła logiczna:  [13.4] >= [2.1.2]","x","x","x","x",{"$f":"IF(I99>=I25,\"OK\",\"BŁĄD\")","v":"OK"},{"$f":"IF(J99>=J25,\"OK\",\"BŁĄD\")","v":"OK"},{"$f":"IF(K99>=K25,\"OK\",\"BŁĄD\")","v":"OK"},{"$f":"IF(L99>=L25,\"OK\",\"BŁĄD\")","v":"OK"}]
[null,"[14.3] >= [14.3.1] + [14.3.2] + [14.3.3]","[14.3] >= [14.3.1] + [14.3.2] + [14.3.3]","Reguła logiczna:  [14.3] >= [14.3.1] + [14.3.2] + [14.3.3]","x","x","x","x",{"$f":"IF(I106>=(I107+I108+I109),\"OK\",\"BŁĄD\")","v":"OK"},{"$f":"IF(J106>=(J107+J108+J109),\"OK\",\"BŁĄD\")","v":"OK"},{"$f":"IF(K106>=(K107+K108+K109),\"OK\",\"BŁĄD\")","v":"OK"},{"$f":"IF(L106>=(L107+L108+L109),\"OK\",\"BŁĄD\")","v":"OK"}]
[null,"[13.1] >= [13.3]","[13.1] >= [13.3]","Reguła logiczna:  [15.1] >= [15.1.1]","x","x","x","x",{"$f":"IF(I112>=I113,\"OK\",\"BŁĄD\")","v":"OK"},{"$f":"IF(J112>=J113,\"OK\",\"BŁĄD\")","v":"OK"},{"$f":"IF(K112>=K113,\"OK\",\"BŁĄD\")","v":"OK"},{"$f":"IF(L112>=L113,\"OK\",\"BŁĄD\")","v":"OK"}]
[null,"[2.1.1] >= [2.1.1.1]","[2.1.1] >= [2.1.1.1]","Reguła logiczna:  [2.1.1] >= [2.1.1.1]","x","x","x","x",{"$f":"IF(I23>=I24,\"OK\",\"BŁĄD\")","v":"OK"},{"$f":"IF(J23>=J24,\"OK\",\"BŁĄD\")","v":"OK"},{"$f":"IF(K23>=K24,\"OK\",\"BŁĄD\")","v":"OK"},{"$f":"IF(L23>=L24,\"OK\",\"BŁĄD\")","v":"OK"}]
[null,"[2.1.1] >= [14.3.3]","[2.1.1] >= [14.3.3]","Reguła logiczna:  [2.1.1] >= [14.3.3]","x","x","x","x",{"$f":"IF(I23>=I109,\"OK\",\"BŁĄD\")","v":"OK"},{"$f":"IF(J23>=J109,\"OK\",\"BŁĄD\")","v":"OK"},{"$f":"IF(K23>=K109,\"OK\",\"BŁĄD\")","v":"OK"},{"$f":"IF(L23>=L109,\"OK\",\"BŁĄD\")","v":"OK"}]
[null,"[2.1.3] >= [2.1.3.1] ","[2.1.3] >= [2.1.3.1] ","Reguła logiczna:  [2.1.3] >= [2.1.3.1] ","x","x","x","x",{"$f":"IF(I26>=I27,\"OK\",\"BŁĄD\")","v":"OK"},{"$f":"IF(J26>=J27,\"OK\",\"BŁĄD\")","v":"OK"},{"$f":"IF(K26>=K27,\"OK\",\"BŁĄD\")","v":"OK"},{"$f":"IF(L26>=L27,\"OK\",\"BŁĄD\")","v":"OK"}]
[null,"[2.1.3] >= [2.1.3.1] ","[2.1.3] >= [2.1.3.1] ","Reguła logiczna:  [2.1.3.1] >= [2.1.3.1.1]+[2.1.3.1.2] ","x","x","x","x",{"$f":"IF(I27>=(I28+I29),\"OK\",\"BŁĄD\")","v":"OK"},{"$f":"IF(J27>=J28,\"OK\",\"BŁĄD\")","v":"OK"},{"$f":"IF(K27>=K28,\"OK\",\"BŁĄD\")","v":"OK"},{"$f":"IF(L27>=L28,\"OK\",\"BŁĄD\")","v":"OK"}]
[null,"[2.1] >= ([2.1.1] + [2.1.2] + [2.1.3])","[2.1] >= ([2.1.1] + [2.1.2] + [2.1.3])","Reguła logiczna:  [2.1] >= ([2.1.1] + [2.1.2] + [2.1.3])","x","x","x","x",{"$f":"IF(I22>=(I23+I25+I26),\"OK\",\"BŁĄD\")","v":"OK"},{"$f":"IF(J22>=(J23+J25+J26),\"OK\",\"BŁĄD\")","v":"OK"},{"$f":"IF(K22>=(K23+K25+K26),\"OK\",\"BŁĄD\")","v":"OK"},{"$f":"IF(L22>=(L23+L25+L26),\"OK\",\"BŁĄD\")","v":"OK"}]
[null,"[2.1] >= [11.1]","[2.1] >= [11.1]","Reguła logiczna:  [2.1] >= [11.1]","x","x","x","x",{"$f":"IF(I22>=I66,\"OK\",\"BŁĄD\")","v":"OK"},{"$f":"IF(J22>=J66,\"OK\",\"BŁĄD\")","v":"OK"},{"$f":"IF(K22>=K66,\"OK\",\"BŁĄD\")","v":"OK"},{"$f":"IF(L22>=L66,\"OK\",\"BŁĄD\")","v":"OK"}]
[null,"[2.1] >= [11.3.1]","[2.1] >= [11.3.1]","Reguła logiczna:  [2.1] >= [11.3.1]","x","x","x","x",{"$f":"IF(I22>=I69,\"OK\",\"BŁĄD\")","v":"OK"},{"$f":"IF(J22>=J69,\"OK\",\"BŁĄD\")","v":"OK"},{"$f":"IF(K22>=K69,\"OK\",\"BŁĄD\")","v":"OK"},{"$f":"IF(L22>=L69,\"OK\",\"BŁĄD\")","v":"OK"}]
[null,"[2.1] >= [12.3]","[2.1] >= [12.3]","Reguła logiczna:  [2.1] >= [12.3]","x","x","x","x",{"$f":"IF(I22>=I81,\"OK\",\"BŁĄD\")","v":"OK"},{"$f":"IF(J22>=J81,\"OK\",\"BŁĄD\")","v":"OK"},{"$f":"IF(K22>=K81,\"OK\",\"BŁĄD\")","v":"OK"},{"$f":"IF(L22>=L81,\"OK\",\"BŁĄD\")","v":"OK"}]
[null,"[2.1] >= [13.7]","[2.1] >= [13.7]","Reguła logiczna:  [2.1] >= [13.7]","x","x","x","x",{"$f":"IF(I22>=I102,\"OK\",\"BŁĄD\")","v":"OK"},{"$f":"IF(J22>=J102,\"OK\",\"BŁĄD\")","v":"OK"},{"$f":"IF(K22>=K102,\"OK\",\"BŁĄD\")","v":"OK"},{"$f":"IF(L22>=L102,\"OK\",\"BŁĄD\")","v":"OK"}]
[null,"[2.2] >= [11.3.2]","[2.2] >= [11.3.2]","Reguła logiczna:  [2.2] >= [11.3.2]","x","x","x","x",{"$f":"IF(I30>=I70,\"OK\",\"BŁĄD\")","v":"OK"},{"$f":"IF(J30>=J70,\"OK\",\"BŁĄD\")","v":"OK"},{"$f":"IF(K30>=K70,\"OK\",\"BŁĄD\")","v":"OK"},{"$f":"IF(L30>=L70,\"OK\",\"BŁĄD\")","v":"OK"}]
[null,"[2.2] >= [11.4] + [11.5]","[2.2] >= [11.4] + [11.5]","Reguła logiczna:  [2.2] >= [11.4] + [11.5]","x","x","x","x",{"$f":"IF(I30>=I71+I72,\"OK\",\"BŁĄD\")","v":"OK"},{"$f":"IF(J30>=J71+J72,\"OK\",\"BŁĄD\")","v":"OK"},{"$f":"IF(K30>=K71+K72,\"OK\",\"BŁĄD\")","v":"OK"},{"$f":"IF(L30>=L71+L72,\"OK\",\"BŁĄD\")","v":"OK"}]
[null,"[2.2] >= [11.6]","[2.2] >= [11.6]","Reguła logiczna:  [2.2] >= [11.6]","x","x","x","x",{"$f":"IF(I30>=I73,\"OK\",\"BŁĄD\")","v":"OK"},{"$f":"IF(J30>=J73,\"OK\",\"BŁĄD\")","v":"OK"},{"$f":"IF(K30>=K73,\"OK\",\"BŁĄD\")","v":"OK"},{"$f":"IF(L30>=L73,\"OK\",\"BŁĄD\")","v":"OK"}]
[null,"[2.2] >= [12.4]","[2.2] >= [12.4]","Reguła logiczna:  [2.2] >= [12.4]","x","x","x","x",{"$f":"IF(I30>=I84,\"OK\",\"BŁĄD\")","v":"OK"},{"$f":"IF(J30>=J84,\"OK\",\"BŁĄD\")","v":"OK"},{"$f":"IF(K30>=K84,\"OK\",\"BŁĄD\")","v":"OK"},{"$f":"IF(L30>=L84,\"OK\",\"BŁĄD\")","v":"OK"}]
[null,"[4.1] >= [4.1.1]","[4.1] >= [4.1.1]","Reguła logiczna:  [4.1] >= [4.1.1]","x","x","x","x",{"$f":"IF(I33>=I34,\"OK\",\"BŁĄD\")","v":"OK"},{"$f":"IF(J33>=J34,\"OK\",\"BŁĄD\")","v":"OK"},{"$f":"IF(K33>=K34,\"OK\",\"BŁĄD\")","v":"OK"},{"$f":"IF(L33>=L34,\"OK\",\"BŁĄD\")","v":"OK"}]
[null,"[4.2] >= [4.2.1]","[4.2] >= [4.2.1]","Reguła logiczna:  [4.2] >= [4.2.1]","x","x","x","x",{"$f":"IF(I35>=I36,\"OK\",\"BŁĄD\")","v":"OK"},{"$f":"IF(J35>=J36,\"OK\",\"BŁĄD\")","v":"OK"},{"$f":"IF(K35>=K36,\"OK\",\"BŁĄD\")","v":"OK"},{"$f":"IF(L35>=L36,\"OK\",\"BŁĄD\")","v":"OK"}]
[null,"[4.3] >= [4.3.1]","[4.3] >= [4.3.1]","Reguła logiczna:  [4.3] >= [4.3.1]","x","x","x","x",{"$f":"IF(I37>=I38,\"OK\",\"BŁĄD\")","v":"OK"},{"$f":"IF(J37>=J38,\"OK\",\"BŁĄD\")","v":"OK"},{"$f":"IF(K37>=K38,\"OK\",\"BŁĄD\")","v":"OK"},{"$f":"IF(L37>=L38,\"OK\",\"BŁĄD\")","v":"OK"}]
[null,"[4.4] >= [4.4.1]","[4.4] >= [4.4.1]","Reguła logiczna:  [4.4] >= [4.4.1]","x","x","x","x",{"$f":"IF(I39>=I40,\"OK\",\"BŁĄD\")","v":"OK"},{"$f":"IF(J39>=J40,\"OK\",\"BŁĄD\")","v":"OK"},{"$f":"IF(K39>=K40,\"OK\",\"BŁĄD\")","v":"OK"},{"$f":"IF(L39>=L40,\"OK\",\"BŁĄD\")","v":"OK"}]
[null,"[5.1] >= [5.1.1]","[5.1] >= [5.1.1]","Reguła logiczna:  [5.1] >= [5.1.1]","x","x","x","x",{"$f":"IF(I42>=I43,\"OK\",\"BŁĄD\")","v":"OK"},{"$f":"IF(J42>=J43,\"OK\",\"BŁĄD\")","v":"OK"},{"$f":"IF(K42>=K43,\"OK\",\"BŁĄD\")","v":"OK"},{"$f":"IF(L42>=L43,\"OK\",\"BŁĄD\")","v":"OK"}]
[null,"[5.1] >= [10.1]","[5.1] >= [10.1]","Reguła logiczna:  [5.1] >= [10.1]","x","x","x","x",{"$f":"IF(I42>=I64,\"OK\",\"BŁĄD\")","v":"OK"},{"$f":"IF(J42>=J64,\"OK\",\"BŁĄD\")","v":"OK"},{"$f":"IF(K42>=K64,\"OK\",\"BŁĄD\")","v":"OK"},{"$f":"IF(L42>=L64,\"OK\",\"BŁĄD\")","v":"OK"}]
[null,"[5.1] >= [14.1]","[5.1] >= [14.1]","Reguła logiczna:  [5.1] >= [14.1]","x","x","x","x",{"$f":"IF(I42>=I104,\"OK\",\"BŁĄD\")","v":"OK"},{"$f":"IF(J42>=J104,\"OK\",\"BŁĄD\")","v":"OK"},{"$f":"IF(K42>=K104,\"OK\",\"BŁĄD\")","v":"OK"},{"$f":"IF(L42>=L104,\"OK\",\"BŁĄD\")","v":"OK"}]
[null,"[6] >=[7]","[6] >=[7]","Reguła logiczna:  [6] >=[7]","x","x","x","x",{"$f":"IF(I48>=I49,\"OK\",\"BŁĄD\")","v":"OK"},{"$f":"IF(J48>=J49,\"OK\",\"BŁĄD\")","v":"OK"},{"$f":"IF(K48>=K49,\"OK\",\"BŁĄD\")","v":"OK"},{"$f":"IF(L48>=L49,\"OK\",\"BŁĄD\")","v":"OK"}]
[null,"[6] >= [14.2]","[6] >= [14.2]","Reguła logiczna:  [6] >= [14.2]","x","x","x","x",{"$f":"IF(I48>=I105,\"OK\",\"BŁĄD\")","v":"OK"},{"$f":"IF(J48>=J105,\"OK\",\"BŁĄD\")","v":"OK"},{"$f":"IF(K48>=K105,\"OK\",\"BŁĄD\")","v":"OK"},{"$f":"IF(L48>=L105,\"OK\",\"BŁĄD\")","v":"OK"}]
[null,"7>=13.1","7>=13.1","Reguła logiczna:  7>=13.1","x","x","x","x",{"$f":"IF(I49>=I96,\"OK\",\"BŁĄD\")","v":"OK"},{"$f":"IF(J49>=J96,\"OK\",\"BŁĄD\")","v":"OK"},{"$f":"IF(K49>=K96,\"OK\",\"BŁĄD\")","v":"OK"},{"$f":"IF(L49>=L96,\"OK\",\"BŁĄD\")","v":"OK"}]
[null,"jeżeli [2.1.3] <> 0 to  [2.1.3.1] <> 0 ","jeżeli [2.1.3] <> 0 to  [2.1.3.1] <> 0 ","Reguła logiczna:  jeżeli [2.1.3] <> 0 to  [2.1.3.1] <> 0 ","x","x","x","x",{"$f":"IF(I26<>0,IF(I27<>0,\"OK\",\"BŁĄD\"),\"N/D\")","v":"OK"},{"$f":"IF(J26<>0,IF(J27<>0,\"OK\",\"BŁĄD\"),\"N/D\")","v":"OK"},{"$f":"IF(K26<>0,IF(K27<>0,\"OK\",\"BŁĄD\"),\"N/D\")","v":"OK"},{"$f":"IF(L26<>0,IF(L27<>0,\"OK\",\"BŁĄD\"),\"N/D\")","v":"N/D"}]
[]
[null,null,null,"Kontrola poprawności podstawowych kwot"]
[null,null,null,"Dochody ogółem = bieżące + majątkowe",{"$f":"E11+E18","v":14062028.149999999},12708280.6,15086054.130000001,15409938.1,11885236,13116110,13247270,13379740]
[null,null,null,"Wydatki ogółem = bieżące + majątkowe",{"$f":"E22+E30","v":11481546.43},13777530.739999998,14983740.939999999,15322124.91,13118844,12414710,12545882.4,13379740]
[null,null,null,"Wynik budżetu = dochody ogółem - wydatki ogółem",{"$f":"E10-E21","v":2580481.7200000007},-1069250.1400000006,102313.19000000134,87813.189999999478,-1233608,701400,701387.59999999963,0]
[null,null,null,"Wyliczenie kwoty długu","x",{"$f":"E48+F37-F42+(F105-E105)+F110","v":773956.19},"x",{"$f":"F48+H37-H42+(H105-F105)+H110","v":169179.59999999998},{"$f":"H48+I37-I42+(I105-H105)+I110","v":1402787.6},{"$f":"I48+J37-J42+(J105-I105)+J110","v":701387.60000000009},{"$f":"J48+K37-K42+(K105-J105)+K110","v":0},{"$f":"K48+L37-L42+(L105-K105)+L110","v":0}]
[null,null,null,"Wyliczenie zobowiązań wynikających z przejęcia przez jst zobowiązań po likwidowanych i przekształcanych SZOZ","x",{"$f":"E96-(F98+F99+F100+F101)","v":0},"x",{"$f":"F96-(H98+H99+H100+H101)","v":0},{"$f":"H96-(I98+I99+I100+I101)","v":0},{"$f":"I96-(J98+J99+J100+J101)","v":0},{"$f":"J96-(K98+K99+K100+K101)","v":0},{"$f":"K96-(L98+L99+L100+L101)","v":0}]
[]
[null,null,null,"Analiza ryzyka niespełnienia wskaźnika z art. 243"]
[null,null,null,"Analiza składowych wzoru wskaźnika z art. 243"]
[null,null,null,0,{"$f":"+\"różnica mniejsza od \"&TEXT(D197*100,\"0,0\")&\"%\"","v":"różnica mniejsza od 0,0%"}]
[null,null,null,5.0000000000000001E-3,{"$f":"+\"różnica mniejsza od \"&TEXT(D198*100,\"0,0\")&\"%\"","v":"różnica mniejsza od 0,5%"}]
[null,null,null,0.01,{"$f":"+\"różnica mniejsza od \"&TEXT(D199*100,\"0,0\")&\"%\"","v":"różnica mniejsza od 1,0%"}]
[null,null,null,"max. limit spłat (planistyczny) - (R+O)/D (bez wyłączeń)","x","x","x","x",{"$f":"+IF(I10=0,\"\",I59-I54)","v":0.186},{"$f":"+IF(J10=0,\"\",J59-J54)","v":0.13300000000000001},{"$f":"+IF(K10=0,\"\",K59-K54)","v":0.15640000000000001},{"$f":"+IF(L10=0,\"\",L59-L54)","v":0.2445}]
[null,null,null,"max. limit spłat (planistyczny) - (R+O)/D (z wyłączeniami)","x","x","x","x",{"$f":"+IF(I10=0,\"\",I59-I55)","v":0.186},{"$f":"+IF(J10=0,\"\",J59-J55)","v":0.13300000000000001},{"$f":"+IF(K10=0,\"\",K59-K55)","v":0.15640000000000001},{"$f":"+IF(L10=0,\"\",L59-L55)","v":0.2445}]
[null,null,null,"max. limit spłat (wg wykonania) - (R+O)/D (bez wyłączeń)","x","x","x","x",{"$f":"+IF(I10=0,\"\",I60-I54)","v":0.18459999999999999},{"$f":"+IF(J10=0,\"\",J60-J54)","v":0.13170000000000001},{"$f":"+IF(K10=0,\"\",K60-K54)","v":0.155},{"$f":"+IF(L10=0,\"\",L60-L54)","v":0.2445}]
[null,null,null,"max. limit spłat (wg wykonania) - (R+O)/D (z wyłączeniami)","x","x","x","x",{"$f":"+IF(I10=0,\"\",I60-I55)","v":0.18459999999999999},{"$f":"+IF(J10=0,\"\",J60-J55)","v":0.13170000000000001},{"$f":"+IF(K10=0,\"\",K60-K55)","v":0.155},{"$f":"+IF(L10=0,\"\",L60-L55)","v":0.2445}]

{"sheet":"WPF_AnalizaWsk_ProjektowanieJST","index":1,"n_rows":203,"n_cols":38,"rows_kept":203,"cut":false,"hidden":false,"merged":[[0,5,0,15],[1,5,1,15],[2,5,2,15],[7,4,7,5]]}
[null,"Raport z systemu BeSTi@ - narzędzie opracowane przez Zespół ds. rozwoju technologii IT przy KR RIO",null,null,null,"Pola z tłem tego koloru są obliczane automatycznie i nie powinny być nadpisywane w celu ochrony formuł"]
[null,"Niniejsze zestawienie można samodzielnie formatować i modyfikować wartości",null,null,null,"Pola z tłem tego koloru są obliczane automatycznie"]
[null,"Układ WPF wg Rozporządzenia Min.Fin. z 10.01.2013 po zmianie z DzU.2013.1736 oraz DzU.2014.1127",null,null,null,"Pola z tłem tego koloru można edytowac wprowadzając nowe wartości (projektowanie WPF i obliczanie wskaźników)"]
[]
[null,"Nr Uchwały:",null,{"$f":"DaneZrodlowe!B4","v":"1"},null,null,null,null,{"$f":"D6&\" - \"&\"WPF za lata \"&D7&\" - Nr Uchwały JST: \"&D5","v":"KRZYŻANÓW - WPF za lata 2015 - 2018 - Nr Uchwały JST: 1"}]
[null,"Nazwa JST:",null,{"$f":"DaneZrodlowe!C4","v":"KRZYŻANÓW"}]
[null,"WPF za lata:",null,{"$f":"CONCATENATE(DaneZrodlowe!N1,\" - \",DaneZrodlowe!Q1)","v":"2015 - 2018"},null,null,null,null,null,"zaokrąglaj wskaźniki procentowe do liczby miejsc po przecinku:",2]
[null,null,null,null,"Wykonanie ",null,"Plan 3 kw.","Wykonanie ",{"$f":"\"\"","v":""}]
["X","Lp.","Formuła","Wyszczególnienie",{"$f":"+F9-1","v":2012},{"$f":"+G9-1","v":2013},{"$f":"+H9","v":2014},{"$f":"+I9-1","v":2014},{"$f":"+DaneZrodlowe!$N$1","v":2015},{"$f":"+I9+1","v":2016},{"$f":"+J9+1","v":2017},2018,2019,2020,2021,2022,2023,2024,2025,2026,2027,2028,2029,2030,2031,2032,2033,2034,2035,2036,2037,2038,2039,2040,2041,2042,2043,2044]
["x",1,"[1.1]+[1.2]","Dochody ogółem",{"$f":"Zał.1_WPF_bazowy!E10","v":14062028.15},{"$f":"Zał.1_WPF_bazowy!F10","v":12708280.6},{"$f":"Zał.1_WPF_bazowy!G10","v":15086054.130000001},{"$f":"+H11+H18","v":15409938.1},{"$f":"+I11+I18","v":11885236},{"$f":"+J11+J18","v":13116110},13247270,13379740,{"$error":"#REF!"},{"$error":"#REF!"},{"$error":"#REF!"},{"$error":"#REF!"},{"$error":"#REF!"},{"$error":"#REF!"},{"$error":"#REF!"},{"$error":"#REF!"},{"$error":"#REF!"},{"$error":"#REF!"},{"$error":"#REF!"},{"$error":"#REF!"},{"$error":"#REF!"},{"$error":"#REF!"},{"$error":"#REF!"},{"$error":"#REF!"},{"$error":"#REF!"},{"$error":"#REF!"},{"$error":"#REF!"},{"$error":"#REF!"},{"$error":"#REF!"},{"$error":"#REF!"},{"$error":"#REF!"},{"$error":"#REF!"},{"$error":"#REF!"},{"$error":"#REF!"}]
["x","1.1",null,"Dochody bieżące",{"$f":"Zał.1_WPF_bazowy!E11","v":12660364.539999999},{"$f":"Zał.1_WPF_bazowy!F11","v":11968299.93},{"$f":"Zał.1_WPF_bazowy!G11","v":12203735.060000001},{"$f":"Zał.1_WPF_bazowy!H11","v":12527619.029999999},{"$f":"+Zał.1_WPF_bazowy!I11","v":11877336},{"$f":"+Zał.1_WPF_bazowy!J11","v":13116110},{"$f":"+Zał.1_WPF_bazowy!K11","v":13247270},{"$f":"+Zał.1_WPF_bazowy!L11","v":13379740},{"$f":"+Zał.1_WPF_bazowy!#REF!","v":{"$error":"#REF!"}},{"$f":"+Zał.1_WPF_bazowy!#REF!","v":{"$error":"#REF!"}},{"$f":"+Zał.1_WPF_bazowy!#REF!","v":{"$error":"#REF!"}},{"$f":"+Zał.1_WPF_bazowy!#REF!","v":{"$error":"#REF!"}},{"$f":"+Zał.1_WPF_bazowy!#REF!","v":{"$error":"#REF!"}},{"$f":"+Zał.1_WPF_bazowy!#REF!","v":{"$error":"#REF!"}},{"$f":"+Zał.1_WPF_bazowy!#REF!","v":{"$error":"#REF!"}},{"$f":"+Zał.1_WPF_bazowy!#REF!","v":{"$error":"#REF!"}},{"$f":"+Zał.1_WPF_bazowy!#REF!","v":{"$error":"#REF!"}},{"$f":"+Zał.1_WPF_bazowy!#REF!","v":{"$error":"#REF!"}},{"$f":"+Zał.1_WPF_bazowy!#REF!","v":{"$error":"#REF!"}},{"$f":"+Zał.1_WPF_bazowy!#REF!","v":{"$error":"#REF!"}},{"$f":"+Zał.1_WPF_bazowy!#REF!","v":{"$error":"#REF!"}},{"$f":"+Zał.1_WPF_bazowy!#REF!","v":{"$error":"#REF!"}},{"$f":"+Zał.1_WPF_bazowy!#REF!","v":{"$error":"#REF!"}},{"$f":"+Zał.1_WPF_bazowy!#REF!","v":{"$error":"#REF!"}},{"$f":"+Zał.1_WPF_bazowy!#REF!","v":{"$error":"#REF!"}},{"$f":"+Zał.1_WPF_bazowy!#REF!","v":{"$error":"#REF!"}},{"$f":"+Zał.1_WPF_bazowy!#REF!","v":{"$error":"#REF!"}},{"$f":"+Zał.1_WPF_bazowy!#REF!","v":{"$error":"#REF!"}},{"$f":"+Zał.1_WPF_bazowy!#REF!","v":{"$error":"#REF!"}},{"$f":"+Zał.1_WPF_bazowy!#REF!","v":{"$error":"#REF!"}},{"$f":"+Zał.1_WPF_bazowy!#REF!","v":{"$error":"#REF!"}},{"$f":"+Zał.1_WPF_bazowy!#REF!","v":{"$error":"#REF!"}},{"$f":"+Zał.1_WPF_bazowy!#REF!","v":{"$error":"#REF!"}},{"$f":"+Zał.1_WPF_bazowy!#REF!","v":{"$error":"#REF!"}}]
[null,"1.1.1",null,"dochody z tytułu udziału we wpływach z podatku dochodowego od osób fizycznych",{"$f":"Zał.1_WPF_bazowy!E12","v":1398132},{"$f":"Zał.1_WPF_bazowy!F12","v":1390365},{"$f":"Zał.1_WPF_bazowy!G12","v":1335088},{"$f":"Zał.1_WPF_bazowy!H12","v":1335088},{"$f":"+Zał.1_WPF_bazowy!I12","v":1418820},{"$f":"+Zał.1_WPF_bazowy!J12","v":1433008},{"$f":"+Zał.1_WPF_bazowy!K12","v":1447338},{"$f":"+Zał.1_WPF_bazowy!L12","v":1461811},{"$f":"+Zał.1_WPF_bazowy!#REF!","v":{"$error":"#REF!"}},{"$f":"+Zał.1_WPF_bazowy!#REF!","v":{"$error":"#REF!"}},{"$f":"+Zał.1_WPF_bazowy!#REF!","v":{"$error":"#REF!"}},{"$f":"+Zał.1_WPF_bazowy!#REF!","v":{"$error":"#REF!"}},{"$f":"+Zał.1_WPF_bazowy!#REF!","v":{"$error":"#REF!"}},{"$f":"+Zał.1_WPF_bazowy!#REF!","v":{"$error":"#REF!"}},{"$f":"+Zał.1_WPF_bazowy!#REF!","v":{"$error":"#REF!"}},{"$f":"+Zał.1_WPF_bazowy!#REF!","v":{"$error":"#REF!"}},{"$f":"+Zał.1_WPF_bazowy!#REF!","v":{"$error":"#REF!"}},{"$f":"+Zał.1_WPF_bazowy!#REF!","v":{"$error":"#REF!"}},{"$f":"+Zał.1_WPF_bazowy!#REF!","v":{"$error":"#REF!"}},{"$f":"+Zał.1_WPF_bazowy!#REF!","v":{"$error":"#REF!"}},{"$f":"+Zał.1_WPF_bazowy!#REF!","v":{"$error":"#REF!"}},{"$f":"+Zał.1_WPF_bazowy!#REF!","v":{"$error":"#REF!"}},{"$f":"+Zał.1_WPF_bazowy!#REF!","v":{"$error":"#REF!"}},{"$f":"+Zał.1_WPF_bazowy!#REF!","v":{"$error":"#REF!"}},{"$f":"+Zał.1_WPF_bazowy!#REF!","v":{"$error":"#REF!"}},{"$f":"+Zał.1_WPF_bazowy!#REF!","v":{"$error":"#REF!"}},{"$f":"+Zał.1_WPF_bazowy!#REF!","v":{"$error":"#REF!"}},{"$f":"+Zał.1_WPF_bazowy!#REF!","v":{"$error":"#REF!"}},{"$f":"+Zał.1_WPF_bazowy!#REF!","v":{"$error":"#REF!"}},{"$f":"+Zał.1_WPF_bazowy!#REF!","v":{"$error":"#REF!"}},{"$f":"+Zał.1_WPF_bazowy!#REF!","v":{"$error":"#REF!"}},{"$f":"+Zał.1_WPF_bazowy!#REF!","v":{"$error":"#REF!"}},{"$f":"+Zał.1_WPF_bazowy!#REF!","v":{"$error":"#REF!"}},{"$f":"+Zał.1_WPF_bazowy!#REF!","v":{"$error":"#REF!"}}]
[null,"1.1.2",null,"dochody z tytułu udziału we wpływach z podatku dochodowego od osób prawnych",{"$f":"Zał.1_WPF_bazowy!E13","v":873.76},{"$f":"Zał.1_WPF_bazowy!F13","v":654.23},{"$f":"Zał.1_WPF_bazowy!G13","v":1000},{"$f":"Zał.1_WPF_bazowy!H13","v":1000},{"$f":"+Zał.1_WPF_bazowy!I13","v":2000},{"$f":"+Zał.1_WPF_bazowy!J13","v":2000},{"$f":"+Zał.1_WPF_bazowy!K13","v":2000},{"$f":"+Zał.1_WPF_bazowy!L13","v":2000},{"$f":"+Zał.1_WPF_bazowy!#REF!","v":{"$error":"#REF!"}},{"$f":"+Zał.1_WPF_bazowy!#REF!","v":{"$error":"#REF!"}},{"$f":"+Zał.1_WPF_bazowy!#REF!","v":{"$error":"#REF!"}},{"$f":"+Zał.1_WPF_bazowy!#REF!","v":{"$error":"#REF!"}},{"$f":"+Zał.1_WPF_bazowy!#REF!","v":{"$error":"#REF!"}},{"$f":"+Zał.1_WPF_bazowy!#REF!","v":{"$error":"#REF!"}},{"$f":"+Zał.1_WPF_bazowy!#REF!","v":{"$error":"#REF!"}},{"$f":"+Zał.1_WPF_bazowy!#REF!","v":{"$error":"#REF!"}},{"$f":"+Zał.1_WPF_bazowy!#REF!","v":{"$error":"#REF!"}},{"$f":"+Zał.1_WPF_bazowy!#REF!","v":{"$error":"#REF!"}},{"$f":"+Zał.1_WPF_bazowy!#REF!","v":{"$error":"#REF!"}},{"$f":"+Zał.1_WPF_bazowy!#REF!","v":{"$error":"#REF!"}},{"$f":"+Zał.1_WPF_bazowy!#REF!","v":{"$error":"#REF!"}},{"$f":"+Zał.1_WPF_bazowy!#REF!","v":{"$error":"#REF!"}},{"$f":"+Zał.1_WPF_bazowy!#REF!","v":{"$error":"#REF!"}},{"$f":"+Zał.1_WPF_bazowy!#REF!","v":{"$error":"#REF!"}},{"$f":"+Zał.1_WPF_bazowy!#REF!","v":{"$error":"#REF!"}},{"$f":"+Zał.1_WPF_bazowy!#REF!","v":{"$error":"#REF!"}},{"$f":"+Zał.1_WPF_bazowy!#REF!","v":{"$error":"#REF!"}},{"$f":"+Zał.1_WPF_bazowy!#REF!","v":{"$error":"#REF!"}},{"$f":"+Zał.1_WPF_bazowy!#REF!","v":{"$error":"#REF!"}},{"$f":"+Zał.1_WPF_bazowy!#REF!","v":{"$error":"#REF!"}},{"$f":"+Zał.1_WPF_bazowy!#REF!","v":{"$error":"#REF!"}},{"$f":"+Zał.1_WPF_bazowy!#REF!","v":{"$error":"#REF!"}},{"$f":"+Zał.1_WPF_bazowy!#REF!","v":{"$error":"#REF!"}},{"$f":"+Zał.1_WPF_bazowy!#REF!","v":{"$error":"#REF!"}}]
[null,"1.1.3",null,"podatki i opłaty",{"$f":"Zał.1_WPF_bazowy!E14","v":4719070.97},{"$f":"Zał.1_WPF_bazowy!F14","v":3241540.05},{"$f":"Zał.1_WPF_bazowy!G14","v":3910601},{"$f":"Zał.1_WPF_bazowy!H14","v":3902601},{"$f":"+Zał.1_WPF_bazowy!I14","v":4676056},{"$f":"+Zał.1_WPF_bazowy!J14","v":5842816},{"$f":"+Zał.1_WPF_bazowy!K14","v":5901244},{"$f":"+Zał.1_WPF_bazowy!L14","v":5960256},{"$f":"+Zał.1_WPF_bazowy!#REF!","v":{"$error":"#REF!"}},{"$f":"+Zał.1_WPF_bazowy!#REF!","v":{"$error":"#REF!"}},{"$f":"+Zał.1_WPF_bazowy!#REF!","v":{"$error":"#REF!"}},{"$f":"+Zał.1_WPF_bazowy!#REF!","v":{"$error":"#REF!"}},{"$f":"+Zał.1_WPF_bazowy!#REF!","v":{"$error":"#REF!"}},{"$f":"+Zał.1_WPF_bazowy!#REF!","v":{"$error":"#REF!"}},{"$f":"+Zał.1_WPF_bazowy!#REF!","v":{"$error":"#REF!"}},{"$f":"+Zał.1_WPF_bazowy!#REF!","v":{"$error":"#REF!"}},{"$f":"+Zał.1_WPF_bazowy!#REF!","v":{"$error":"#REF!"}},{"$f":"+Zał.1_WPF_bazowy!#REF!","v":{"$error":"#REF!"}},{"$f":"+Zał.1_WPF_bazowy!#REF!","v":{"$error":"#REF!"}},{"$f":"+Zał.1_WPF_bazowy!#REF!","v":{"$error":"#REF!"}},{"$f":"+Zał.1_WPF_bazowy!#REF!","v":{"$error":"#REF!"}},{"$f":"+Zał.1_WPF_bazowy!#REF!","v":{"$error":"#REF!"}},{"$f":"+Zał.1_WPF_bazowy!#REF!","v":{"$error":"#REF!"}},{"$f":"+Zał.1_WPF_bazowy!#REF!","v":{"$error":"#REF!"}},{"$f":"+Zał.1_WPF_bazowy!#REF!","v":{"$error":"#REF!"}},{"$f":"+Zał.1_WPF_bazowy!#REF!","v":{"$error":"#REF!"}},{"$f":"+Zał.1_WPF_bazowy!#REF!","v":{"$error":"#REF!"}},{"$f":"+Zał.1_WPF_bazowy!#REF!","v":{"$error":"#REF!"}},{"$f":"+Zał.1_WPF_bazowy!#REF!","v":{"$error":"#REF!"}},{"$f":"+Zał.1_WPF_bazowy!#REF!","v":{"$error":"#REF!"}},{"$f":"+Zał.1_WPF_bazowy!#REF!","v":{"$error":"#REF!"}},{"$f":"+Zał.1_WPF_bazowy!#REF!","v":{"$error":"#REF!"}},{"$f":"+Zał.1_WPF_bazowy!#REF!","v":{"$error":"#REF!"}},{"$f":"+Zał.1_WPF_bazowy!#REF!","v":{"$error":"#REF!"}}]
[null,"1.1.3.1",null,"z podatku od nieruchomości",{"$f":"Zał.1_WPF_bazowy!E15","v":1608877.11},{"$f":"Zał.1_WPF_bazowy!F15","v":1467888.16},{"$f":"Zał.1_WPF_bazowy!G15","v":1532389},{"$f":"Zał.1_WPF_bazowy!H15","v":1532389},{"$f":"+Zał.1_WPF_bazowy!I15","v":1534000},{"$f":"+Zał.1_WPF_bazowy!J15","v":2669340},{"$f":"+Zał.1_WPF_bazowy!K15","v":2696034},{"$f":"+Zał.1_WPF_bazowy!L15","v":2723000},{"$f":"+Zał.1_WPF_bazowy!#REF!","v":{"$error":"#REF!"}},{"$f":"+Zał.1_WPF_bazowy!#REF!","v":{"$error":"#REF!"}},{"$f":"+Zał.1_WPF_bazowy!#REF!","v":{"$error":"#REF!"}},{"$f":"+Zał.1_WPF_bazowy!#REF!","v":{"$error":"#REF!"}},{"$f":"+Zał.1_WPF_bazowy!#REF!","v":{"$error":"#REF!"}},{"$f":"+Zał.1_WPF_bazowy!#REF!","v":{"$error":"#REF!"}},{"$f":"+Zał.1_WPF_bazowy!#REF!","v":{"$error":"#REF!"}},{"$f":"+Zał.1_WPF_bazowy!#REF!","v":{"$error":"#REF!"}},{"$f":"+Zał.1_WPF_bazowy!#REF!","v":{"$error":"#REF!"}},{"$f":"+Zał.1_WPF_bazowy!#REF!","v":{"$error":"#REF!"}},{"$f":"+Zał.1_WPF_bazowy!#REF!","v":{"$error":"#REF!"}},{"$f":"+Zał.1_WPF_bazowy!#REF!","v":{"$error":"#REF!"}},{"$f":"+Zał.1_WPF_bazowy!#REF!","v":{"$error":"#REF!"}},{"$f":"+Zał.1_WPF_bazowy!#REF!","v":{"$error":"#REF!"}},{"$f":"+Zał.1_WPF_bazowy!#REF!","v":{"$error":"#REF!"}},{"$f":"+Zał.1_WPF_bazowy!#REF!","v":{"$error":"#REF!"}},{"$f":"+Zał.1_WPF_bazowy!#REF!","v":{"$error":"#REF!"}},{"$f":"+Zał.1_WPF_bazowy!#REF!","v":{"$error":"#REF!"}},{"$f":"+Zał.1_WPF_bazowy!#REF!","v":{"$error":"#REF!"}},{"$f":"+Zał.1_WPF_bazowy!#REF!","v":{"$error":"#REF!"}},{"$f":"+Zał.1_WPF_bazowy!#REF!","v":{"$error":"#REF!"}},{"$f":"+Zał.1_WPF_bazowy!#REF!","v":{"$error":"#REF!"}},{"$f":"+Zał.1_WPF_bazowy!#REF!","v":{"$error":"#REF!"}},{"$f":"+Zał.1_WPF_bazowy!#REF!","v":{"$error":"#REF!"}},{"$f":"+Zał.1_WPF_bazowy!#REF!","v":{"$error":"#REF!"}},{"$f":"+Zał.1_WPF_bazowy!#REF!","v":{"$error":"#REF!"}}]
[null,"1.1.4",null,"z subwencji ogólnej",{"$f":"Zał.1_WPF_bazowy!E16","v":4481337},{"$f":"Zał.1_WPF_bazowy!F16","v":4504728},{"$f":"Zał.1_WPF_bazowy!G16","v":3274658},{"$f":"Zał.1_WPF_bazowy!H16","v":3274658},{"$f":"+Zał.1_WPF_bazowy!I16","v":3862767},{"$f":"+Zał.1_WPF_bazowy!J16","v":3901395},{"$f":"+Zał.1_WPF_bazowy!K16","v":3940400},{"$f":"+Zał.1_WPF_bazowy!L16","v":3979813},{"$f":"+Zał.1_WPF_bazowy!#REF!","v":{"$error":"#REF!"}},{"$f":"+Zał.1_WPF_bazowy!#REF!","v":{"$error":"#REF!"}},{"$f":"+Zał.1_WPF_bazowy!#REF!","v":{"$error":"#REF!"}},{"$f":"+Zał.1_WPF_bazowy!#REF!","v":{"$error":"#REF!"}},{"$f":"+Zał.1_WPF_bazowy!#REF!","v":{"$error":"#REF!"}},{"$f":"+Zał.1_WPF_bazowy!#REF!","v":{"$error":"#REF!"}},{"$f":"+Zał.1_WPF_bazowy!#REF!","v":{"$error":"#REF!"}},{"$f":"+Zał.1_WPF_bazowy!#REF!","v":{"$error":"#REF!"}},{"$f":"+Zał.1_WPF_bazowy!#REF!","v":{"$error":"#REF!"}},{"$f":"+Zał.1_WPF_bazowy!#REF!","v":{"$error":"#REF!"}},{"$f":"+Zał.1_WPF_bazowy!#REF!","v":{"$error":"#REF!"}},{"$f":"+Zał.1_WPF_bazowy!#REF!","v":{"$error":"#REF!"}},{"$f":"+Zał.1_WPF_bazowy!#REF!","v":{"$error":"#REF!"}},{"$f":"+Zał.1_WPF_bazowy!#REF!","v":{"$error":"#REF!"}},{"$f":"+Zał.1_WPF_bazowy!#REF!","v":{"$error":"#REF!"}},{"$f":"+Zał.1_WPF_bazowy!#REF!","v":{"$error":"#REF!"}},{"$f":"+Zał.1_WPF_bazowy!#REF!","v":{"$error":"#REF!"}},{"$f":"+Zał.1_WPF_bazowy!#REF!","v":{"$error":"#REF!"}},{"$f":"+Zał.1_WPF_bazowy!#REF!","v":{"$error":"#REF!"}},{"$f":"+Zał.1_WPF_bazowy!#REF!","v":{"$error":"#REF!"}},{"$f":"+Zał.1_WPF_bazowy!#REF!","v":{"$error":"#REF!"}},{"$f":"+Zał.1_WPF_bazowy!#REF!","v":{"$error":"#REF!"}},{"$f":"+Zał.1_WPF_bazowy!#REF!","v":{"$error":"#REF!"}},{"$f":"+Zał.1_WPF_bazowy!#REF!","v":{"$error":"#REF!"}},{"$f":"+Zał.1_WPF_bazowy!#REF!","v":{"$error":"#REF!"}},{"$f":"+Zał.1_WPF_bazowy!#REF!","v":{"$error":"#REF!"}}]
[null,"1.1.5",null,"z tytułu dotacji i środków przeznaczonych na cele bieżące",{"$f":"Zał.1_WPF_bazowy!E17","v":2060950.81},{"$f":"Zał.1_WPF_bazowy!F17","v":2099883.4300000002},{"$f":"Zał.1_WPF_bazowy!G17","v":2095696.81},{"$f":"Zał.1_WPF_bazowy!H17","v":2433356.9500000002},{"$f":"+Zał.1_WPF_bazowy!I17","v":1273753},{"$f":"+Zał.1_WPF_bazowy!J17","v":1273753},{"$f":"+Zał.1_WPF_bazowy!K17","v":1273753},{"$f":"+Zał.1_WPF_bazowy!L17","v":1273753},{"$f":"+Zał.1_WPF_bazowy!#REF!","v":{"$error":"#REF!"}},{"$f":"+Zał.1_WPF_bazowy!#REF!","v":{"$error":"#REF!"}},{"$f":"+Zał.1_WPF_bazowy!#REF!","v":{"$error":"#REF!"}},{"$f":"+Zał.1_WPF_bazowy!#REF!","v":{"$error":"#REF!"}},{"$f":"+Zał.1_WPF_bazowy!#REF!","v":{"$error":"#REF!"}},{"$f":"+Zał.1_WPF_bazowy!#REF!","v":{"$error":"#REF!"}},{"$f":"+Zał.1_WPF_bazowy!#REF!","v":{"$error":"#REF!"}},{"$f":"+Zał.1_WPF_bazowy!#REF!","v":{"$error":"#REF!"}},{"$f":"+Zał.1_WPF_bazowy!#REF!","v":{"$error":"#REF!"}},{"$f":"+Zał.1_WPF_bazowy!#REF!","v":{"$error":"#REF!"}},{"$f":"+Zał.1_WPF_bazowy!#REF!","v":{"$error":"#REF!"}},{"$f":"+Zał.1_WPF_bazowy!#REF!","v":{"$error":"#REF!"}},{"$f":"+Zał.1_WPF_bazowy!#REF!","v":{"$error":"#REF!"}},{"$f":"+Zał.1_WPF_bazowy!#REF!","v":{"$error":"#REF!"}},{"$f":"+Zał.1_WPF_bazowy!#REF!","v":{"$error":"#REF!"}},{"$f":"+Zał.1_WPF_bazowy!#REF!","v":{"$error":"#REF!"}},{"$f":"+Zał.1_WPF_bazowy!#REF!","v":{"$error":"#REF!"}},{"$f":"+Zał.1_WPF_bazowy!#REF!","v":{"$error":"#REF!"}},{"$f":"+Zał.1_WPF_bazowy!#REF!","v":{"$error":"#REF!"}},{"$f":"+Zał.1_WPF_bazowy!#REF!","v":{"$error":"#REF!"}},{"$f":"+Zał.1_WPF_bazowy!#REF!","v":{"$error":"#REF!"}},{"$f":"+Zał.1_WPF_bazowy!#REF!","v":{"$error":"#REF!"}},{"$f":"+Zał.1_WPF_bazowy!#REF!","v":{"$error":"#REF!"}},{"$f":"+Zał.1_WPF_bazowy!#REF!","v":{"$error":"#REF!"}},{"$f":"+Zał.1_WPF_bazowy!#REF!","v":{"$error":"#REF!"}},{"$f":"+Zał.1_WPF_bazowy!#REF!","v":{"$error":"#REF!"}}]
["x","1.2",null,"Dochody majątkowe, w tym",{"$f":"Zał.1_WPF_bazowy!E18","v":1401663.61},{"$f":"Zał.1_WPF_bazowy!F18","v":739980.67},{"$f":"Zał.1_WPF_bazowy!G18","v":2882319.07},{"$f":"Zał.1_WPF_bazowy!H18","v":2882319.07},{"$f":"+Zał.1_WPF_bazowy!I18","v":7900},{"$f":"+Zał.1_WPF_bazowy!J18","v":0},{"$f":"+Zał.1_WPF_bazowy!K18","v":0},{"$f":"+Zał.1_WPF_bazowy!L18","v":0},{"$f":"+Zał.1_WPF_bazowy!#REF!","v":{"$error":"#REF!"}},{"$f":"+Zał.1_WPF_bazowy!#REF!","v":{"$error":"#REF!"}},{"$f":"+Zał.1_WPF_bazowy!#REF!","v":{"$error":"#REF!"}},{"$f":"+Zał.1_WPF_bazowy!#REF!","v":{"$error":"#REF!"}},{"$f":"+Zał.1_WPF_bazowy!#REF!","v":{"$error":"#REF!"}},{"$f":"+Zał.1_WPF_bazowy!#REF!","v":{"$error":"#REF!"}},{"$f":"+Zał.1_WPF_bazowy!#REF!","v":{"$error":"#REF!"}},{"$f":"+Zał.1_WPF_bazowy!#REF!","v":{"$error":"#REF!"}},{"$f":"+Zał.1_WPF_bazowy!#REF!","v":{"$error":"#REF!"}},{"$f":"+Zał.1_WPF_bazowy!#REF!","v":{"$error":"#REF!"}},{"$f":"+Zał.1_WPF_bazowy!#REF!","v":{"$error":"#REF!"}},{"$f":"+Zał.1_WPF_bazowy!#REF!","v":{"$error":"#REF!"}},{"$f":"+Zał.1_WPF_bazowy!#REF!","v":{"$error":"#REF!"}},{"$f":"+Zał.1_WPF_bazowy!#REF!","v":{"$error":"#REF!"}},{"$f":"+Zał.1_WPF_bazowy!#REF!","v":{"$error":"#REF!"}},{"$f":"+Zał.1_WPF_bazowy!#REF!","v":{"$error":"#REF!"}},{"$f":"+Zał.1_WPF_bazowy!#REF!","v":{"$error":"#REF!"}},{"$f":"+Zał.1_WPF_bazowy!#REF!","v":{"$error":"#REF!"}},{"$f":"+Zał.1_WPF_bazowy!#REF!","v":{"$error":"#REF!"}},{"$f":"+Zał.1_WPF_bazowy!#REF!","v":{"$error":"#REF!"}},{"$f":"+Zał.1_WPF_bazowy!#REF!","v":{"$error":"#REF!"}},{"$f":"+Zał.1_WPF_bazowy!#REF!","v":{"$error":"#REF!"}},{"$f":"+Zał.1_WPF_bazowy!#REF!","v":{"$error":"#REF!"}},{"$f":"+Zał.1_WPF_bazowy!#REF!","v":{"$error":"#REF!"}},{"$f":"+Zał.1_WPF_bazowy!#REF!","v":{"$error":"#REF!"}},{"$f":"+Zał.1_WPF_bazowy!#REF!","v":{"$error":"#REF!"}}]
["x","1.2.1",null,"ze sprzedaży majątku",{"$f":"Zał.1_WPF_bazowy!E19","v":69038.91},{"$f":"Zał.1_WPF_bazowy!F19","v":6200},{"$f":"Zał.1_WPF_bazowy!G19","v":220000},{"$f":"Zał.1_WPF_bazowy!H19","v":220000},{"$f":"+Zał.1_WPF_bazowy!I19","v":0},{"$f":"+Zał.1_WPF_bazowy!J19","v":0},{"$f":"+Zał.1_WPF_bazowy!K19","v":0},{"$f":"+Zał.1_WPF_bazowy!L19","v":0},{"$f":"+Zał.1_WPF_bazowy!#REF!","v":{"$error":"#REF!"}},{"$f":"+Zał.1_WPF_bazowy!#REF!","v":{"$error":"#REF!"}},{"$f":"+Zał.1_WPF_bazowy!#REF!","v":{"$error":"#REF!"}},{"$f":"+Zał.1_WPF_bazowy!#REF!","v":{"$error":"#REF!"}},{"$f":"+Zał.1_WPF_bazowy!#REF!","v":{"$error":"#REF!"}},{"$f":"+Zał.1_WPF_bazowy!#REF!","v":{"$error":"#REF!"}},{"$f":"+Zał.1_WPF_bazowy!#REF!","v":{"$error":"#REF!"}},{"$f":"+Zał.1_WPF_bazowy!#REF!","v":{"$error":"#REF!"}},{"$f":"+Zał.1_WPF_bazowy!#REF!","v":{"$error":"#REF!"}},{"$f":"+Zał.1_WPF_bazowy!#REF!","v":{"$error":"#REF!"}},{"$f":"+Zał.1_WPF_bazowy!#REF!","v":{"$error":"#REF!"}},{"$f":"+Zał.1_WPF_bazowy!#REF!","v":{"$error":"#REF!"}},{"$f":"+Zał.1_WPF_bazowy!#REF!","v":{"$error":"#REF!"}},{"$f":"+Zał.1_WPF_bazowy!#REF!","v":{"$error":"#REF!"}},{"$f":"+Zał.1_WPF_bazowy!#REF!","v":{"$error":"#REF!"}},{"$f":"+Zał.1_WPF_bazowy!#REF!","v":{"$error":"#REF!"}},{"$f":"+Zał.1_WPF_bazowy!#REF!","v":{"$error":"#REF!"}},{"$f":"+Zał.1_WPF_bazowy!#REF!","v":{"$error":"#REF!"}},{"$f":"+Zał.1_WPF_bazowy!#REF!","v":{"$error":"#REF!"}},{"$f":"+Zał.1_WPF_bazowy!#REF!","v":{"$error":"#REF!"}},{"$f":"+Zał.1_WPF_bazowy!#REF!","v":{"$error":"#REF!"}},{"$f":"+Zał.1_WPF_bazowy!#REF!","v":{"$error":"#REF!"}},{"$f":"+Zał.1_WPF_bazowy!#REF!","v":{"$error":"#REF!"}},{"$f":"+Zał.1_WPF_bazowy!#REF!","v":{"$error":"#REF!"}},{"$f":"+Zał.1_WPF_bazowy!#REF!","v":{"$error":"#REF!"}},{"$f":"+Zał.1_WPF_bazowy!#REF!","v":{"$error":"#REF!"}}]
[null,"1.2.2",null,"z tytułu dotacji oraz środków przeznaczonych na inwestycje",{"$f":"Zał.1_WPF_bazowy!E20","v":1332324.7},{"$f":"Zał.1_WPF_bazowy!F20","v":720552.67},{"$f":"Zał.1_WPF_bazowy!G20","v":2603609.0699999998},{"$f":"Zał.1_WPF_bazowy!H20","v":2603609.0699999998},{"$f":"+Zał.1_WPF_bazowy!I20","v":7900},{"$f":"+Zał.1_WPF_bazowy!J20","v":0},{"$f":"+Zał.1_WPF_bazowy!K20","v":0},{"$f":"+Zał.1_WPF_bazowy!L20","v":0},{"$f":"+Zał.1_WPF_bazowy!#REF!","v":{"$error":"#REF!"}},{"$f":"+Zał.1_WPF_bazowy!#REF!","v":{"$error":"#REF!"}},{"$f":"+Zał.1_WPF_bazowy!#REF!","v":{"$error":"#REF!"}},{"$f":"+Zał.1_WPF_bazowy!#REF!","v":{"$error":"#REF!"}},{"$f":"+Zał.1_WPF_bazowy!#REF!","v":{"$error":"#REF!"}},{"$f":"+Zał.1_WPF_bazowy!#REF!","v":{"$error":"#REF!"}},{"$f":"+Zał.1_WPF_bazowy!#REF!","v":{"$error":"#REF!"}},{"$f":"+Zał.1_WPF_bazowy!#REF!","v":{"$error":"#REF!"}},{"$f":"+Zał.1_WPF_bazowy!#REF!","v":{"$error":"#REF!"}},{"$f":"+Zał.1_WPF_bazowy!#REF!","v":{"$error":"#REF!"}},{"$f":"+Zał.1_WPF_bazowy!#REF!","v":{"$error":"#REF!"}},{"$f":"+Zał.1_WPF_bazowy!#REF!","v":{"$error":"#REF!"}},{"$f":"+Zał.1_WPF_bazowy!#REF!","v":{"$error":"#REF!"}},{"$f":"+Zał.1_WPF_bazowy!#REF!","v":{"$error":"#REF!"}},{"$f":"+Zał.1_WPF_bazowy!#REF!","v":{"$error":"#REF!"}},{"$f":"+Zał.1_WPF_bazowy!#REF!","v":{"$error":"#REF!"}},{"$f":"+Zał.1_WPF_bazowy!#REF!","v":{"$error":"#REF!"}},{"$f":"+Zał.1_WPF_bazowy!#REF!","v":{"$error":"#REF!"}},{"$f":"+Zał.1_WPF_bazowy!#REF!","v":{"$error":"#REF!"}},{"$f":"+Zał.1_WPF_bazowy!#REF!","v":{"$error":"#REF!"}},{"$f":"+Zał.1_WPF_bazowy!#REF!","v":{"$error":"#REF!"}},{"$f":"+Zał.1_WPF_bazowy!#REF!","v":{"$error":"#REF!"}},{"$f":"+Zał.1_WPF_bazowy!#REF!","v":{"$error":"#REF!"}},{"$f":"+Zał.1_WPF_bazowy!#REF!","v":{"$error":"#REF!"}},{"$f":"+Zał.1_WPF_bazowy!#REF!","v":{"$error":"#REF!"}},{"$f":"+Zał.1_WPF_bazowy!#REF!","v":{"$error":"#REF!"}}]
["x",2,"[2.1]+[2.2]","Wydatki ogółem",{"$f":"Zał.1_WPF_bazowy!E21","v":11481546.43},{"$f":"Zał.1_WPF_bazowy!F21","v":13777530.74},{"$f":"Zał.1_WPF_bazowy!G21","v":14983740.939999999},{"$f":"+H22+H30","v":15322124.91},{"$f":"+I22+I30","v":13118844},{"$f":"+J22+J30","v":12414710},12545882.4,13379740,{"$error":"#REF!"},{"$error":"#REF!"},{"$error":"#REF!"},{"$error":"#REF!"},{"$error":"#REF!"},{"$error":"#REF!"},{"$error":"#REF!"},{"$error":"#REF!"},{"$error":"#REF!"},{"$error":"#REF!"},{"$error":"#REF!"},{"$error":"#REF!"},{"$error":"#REF!"},{"$error":"#REF!"},{"$error":"#REF!"},{"$error":"#REF!"},{"$error":"#REF!"},{"$error":"#REF!"},{"$error":"#REF!"},{"$error":"#REF!"},{"$error":"#REF!"},{"$error":"#REF!"},{"$error":"#REF!"},{"$error":"#REF!"},{"$error":"#REF!"},{"$error":"#REF!"}]
["x","2.1",null,"Wydatki bieżące, w tym:",{"$f":"Zał.1_WPF_bazowy!E22","v":9055670.4299999997},{"$f":"Zał.1_WPF_bazowy!F22","v":9384342.0399999991},{"$f":"Zał.1_WPF_bazowy!G22","v":9999493.8699999992},{"$f":"Zał.1_WPF_bazowy!H22","v":10334477.84},{"$f":"+Zał.1_WPF_bazowy!I22","v":9369229},{"$f":"+Zał.1_WPF_bazowy!J22","v":9654720},{"$f":"+Zał.1_WPF_bazowy!K22","v":9820000.4000000004},{"$f":"+Zał.1_WPF_bazowy!L22","v":10030650},{"$f":"+Zał.1_WPF_bazowy!#REF!","v":{"$error":"#REF!"}},{"$f":"+Zał.1_WPF_bazowy!#REF!","v":{"$error":"#REF!"}},{"$f":"+Zał.1_WPF_bazowy!#REF!","v":{"$error":"#REF!"}},{"$f":"+Zał.1_WPF_bazowy!#REF!","v":{"$error":"#REF!"}},{"$f":"+Zał.1_WPF_bazowy!#REF!","v":{"$error":"#REF!"}},{"$f":"+Zał.1_WPF_bazowy!#REF!","v":{"$error":"#REF!"}},{"$f":"+Zał.1_WPF_bazowy!#REF!","v":{"$error":"#REF!"}},{"$f":"+Zał.1_WPF_bazowy!#REF!","v":{"$error":"#REF!"}},{"$f":"+Zał.1_WPF_bazowy!#REF!","v":{"$error":"#REF!"}},{"$f":"+Zał.1_WPF_bazowy!#REF!","v":{"$error":"#REF!"}},{"$f":"+Zał.1_WPF_bazowy!#REF!","v":{"$error":"#REF!"}},{"$f":"+Zał.1_WPF_bazowy!#REF!","v":{"$error":"#REF!"}},{"$f":"+Zał.1_WPF_bazowy!#REF!","v":{"$error":"#REF!"}},{"$f":"+Zał.1_WPF_bazowy!#REF!","v":{"$error":"#REF!"}},{"$f":"+Zał.1_WPF_bazowy!#REF!","v":{"$error":"#REF!"}},{"$f":"+Zał.1_WPF_bazowy!#REF!","v":{"$error":"#REF!"}},{"$f":"+Zał.1_WPF_bazowy!#REF!","v":{"$error":"#REF!"}},{"$f":"+Zał.1_WPF_bazowy!#REF!","v":{"$error":"#REF!"}},{"$f":"+Zał.1_WPF_bazowy!#REF!","v":{"$error":"#REF!"}},{"$f":"+Zał.1_WPF_bazowy!#REF!","v":{"$error":"#REF!"}},{"$f":"+Zał.1_WPF_bazowy!#REF!","v":{"$error":"#REF!"}},{"$f":"+Zał.1_WPF_bazowy!#REF!","v":{"$error":"#REF!"}},{"$f":"+Zał.1_WPF_bazowy!#REF!","v":{"$error":"#REF!"}},{"$f":"+Zał.1_WPF_bazowy!#REF!","v":{"$error":"#REF!"}},{"$f":"+Zał.1_WPF_bazowy!#REF!","v":{"$error":"#REF!"}},{"$f":"+Zał.1_WPF_bazowy!#REF!","v":{"$error":"#REF!"}}]
["x","2.1.1",null,"z tytułu poręczeń i gwarancji",{"$f":"Zał.1_WPF_bazowy!E23","v":0},{"$f":"Zał.1_WPF_bazowy!F23","v":0},{"$f":"Zał.1_WPF_bazowy!G23","v":0},{"$f":"Zał.1_WPF_bazowy!H23","v":0},{"$f":"+Zał.1_WPF_bazowy!I23","v":0},{"$f":"+Zał.1_WPF_bazowy!J23","v":0},{"$f":"+Zał.1_WPF_bazowy!K23","v":0},{"$f":"+Zał.1_WPF_bazowy!L23","v":0},{"$f":"+Zał.1_WPF_bazowy!#REF!","v":{"$error":"#REF!"}},{"$f":"+Zał.1_WPF_bazowy!#REF!","v":{"$error":"#REF!"}},{"$f":"+Zał.1_WPF_bazowy!#REF!","v":{"$error":"#REF!"}},{"$f":"+Zał.1_WPF_bazowy!#REF!","v":{"$error":"#REF!"}},{"$f":"+Zał.1_WPF_bazowy!#REF!","v":{"$error":"#REF!"}},{"$f":"+Zał.1_WPF_bazowy!#REF!","v":{"$error":"#REF!"}},{"$f":"+Zał.1_WPF_bazowy!#REF!","v":{"$error":"#REF!"}},{"$f":"+Zał.1_WPF_bazowy!#REF!","v":{"$error":"#REF!"}},{"$f":"+Zał.1_WPF_bazowy!#REF!","v":{"$error":"#REF!"}},{"$f":"+Zał.1_WPF_bazowy!#REF!","v":{"$error":"#REF!"}},{"$f":"+Zał.1_WPF_bazowy!#REF!","v":{"$error":"#REF!"}},{"$f":"+Zał.1_WPF_bazowy!#REF!","v":{"$error":"#REF!"}},{"$f":"+Zał.1_WPF_bazowy!#REF!","v":{"$error":"#REF!"}},{"$f":"+Zał.1_WPF_bazowy!#REF!","v":{"$error":"#REF!"}},{"$f":"+Zał.1_WPF_bazowy!#REF!","v":{"$error":"#REF!"}},{"$f":"+Zał.1_WPF_bazowy!#REF!","v":{"$error":"#REF!"}},{"$f":"+Zał.1_WPF_bazowy!#REF!","v":{"$error":"#REF!"}},{"$f":"+Zał.1_WPF_bazowy!#REF!","v":{"$error":"#REF!"}},{"$f":"+Zał.1_WPF_bazowy!#REF!","v":{"$error":"#REF!"}},{"$f":"+Zał.1_WPF_bazowy!#REF!","v":{"$error":"#REF!"}},{"$f":"+Zał.1_WPF_bazowy!#REF!","v":{"$error":"#REF!"}},{"$f":"+Zał.1_WPF_bazowy!#REF!","v":{"$error":"#REF!"}},{"$f":"+Zał.1_WPF_bazowy!#REF!","v":{"$error":"#REF!"}},{"$f":"+Zał.1_WPF_bazowy!#REF!","v":{"$error":"#REF!"}},{"$f":"+Zał.1_WPF_bazowy!#REF!","v":{"$error":"#REF!"}},{"$f":"+Zał.1_WPF_bazowy!#REF!","v":{"$error":"#REF!"}}]
["x","2.1.1.1",null,"w tym: gwarancje i poręczenia podlegające wyłączeniu z limitu spłaty zobowiązań, o którym mowa w art. 243 ustawy",{"$f":"Zał.1_WPF_bazowy!E24","v":0},{"$f":"Zał.1_WPF_bazowy!F24","v":0},{"$f":"Zał.1_WPF_bazowy!G24","v":0},{"$f":"Zał.1_WPF_bazowy!H24","v":0},{"$f":"+Zał.1_WPF_bazowy!I24","v":0},{"$f":"+Zał.1_WPF_bazowy!J24","v":0},{"$f":"+Zał.1_WPF_bazowy!K24","v":0},{"$f":"+Zał.1_WPF_bazowy!L24","v":0},{"$f":"+Zał.1_WPF_bazowy!#REF!","v":{"$error":"#REF!"}},{"$f":"+Zał.1_WPF_bazowy!#REF!","v":{"$error":"#REF!"}},{"$f":"+Zał.1_WPF_bazowy!#REF!","v":{"$error":"#REF!"}},{"$f":"+Zał.1_WPF_bazowy!#REF!","v":{"$error":"#REF!"}},{"$f":"+Zał.1_WPF_bazowy!#REF!","v":{"$error":"#REF!"}},{"$f":"+Zał.1_WPF_bazowy!#REF!","v":{"$error":"#REF!"}},{"$f":"+Zał.1_WPF_bazowy!#REF!","v":{"$error":"#REF!"}},{"$f":"+Zał.1_WPF_bazowy!#REF!","v":{"$error":"#REF!"}},{"$f":"+Zał.1_WPF_bazowy!#REF!","v":{"$error":"#REF!"}},{"$f":"+Zał.1_WPF_bazowy!#REF!","v":{"$error":"#REF!"}},{"$f":"+Zał.1_WPF_bazowy!#REF!","v":{"$error":"#REF!"}},{"$f":"+Zał.1_WPF_bazowy!#REF!","v":{"$error":"#REF!"}},{"$f":"+Zał.1_WPF_bazowy!#REF!","v":{"$error":"#REF!"}},{"$f":"+Zał.1_WPF_bazowy!#REF!","v":{"$error":"#REF!"}},{"$f":"+Zał.1_WPF_bazowy!#REF!","v":{"$error":"#REF!"}},{"$f":"+Zał.1_WPF_bazowy!#REF!","v":{"$error":"#REF!"}},{"$f":"+Zał.1_WPF_bazowy!#REF!","v":{"$error":"#REF!"}},{"$f":"+Zał.1_WPF_bazowy!#REF!","v":{"$error":"#REF!"}},{"$f":"+Zał.1_WPF_bazowy!#REF!","v":{"$error":"#REF!"}},{"$f":"+Zał.1_WPF_bazowy!#REF!","v":{"$error":"#REF!"}},{"$f":"+Zał.1_WPF_bazowy!#REF!","v":{"$error":"#REF!"}},{"$f":"+Zał.1_WPF_bazowy!#REF!","v":{"$error":"#REF!"}},{"$f":"+Zał.1_WPF_bazowy!#REF!","v":{"$error":"#REF!"}},{"$f":"+Zał.1_WPF_bazowy!#REF!","v":{"$error":"#REF!"}},{"$f":"+Zał.1_WPF_bazowy!#REF!","v":{"$error":"#REF!"}},{"$f":"+Zał.1_WPF_bazowy!#REF!","v":{"$error":"#REF!"}}]
[null,"2.1.2",null,"na spłatę przejętych zobowiązań samodzielnego publicznego zakładu opieki zdrowotnej przekształconego na zasadach określonych w przepisach  o działalności leczniczej, w wysokości w jakiej nie podlegają sfinansowaniu dotacją z budżetu państwa",{"$f":"+Zał.1_WPF_bazowy!E25","v":0},{"$f":"+Zał.1_WPF_bazowy!F25","v":0},{"$f":"+Zał.1_WPF_bazowy!G25","v":0},{"$f":"+Zał.1_WPF_bazowy!H25","v":0},{"$f":"+Zał.1_WPF_bazowy!I25","v":0},{"$f":"+Zał.1_WPF_bazowy!J25","v":0},{"$f":"+Zał.1_WPF_bazowy!K25","v":0},{"$f":"+Zał.1_WPF_bazowy!L25","v":0},{"$f":"+Zał.1_WPF_bazowy!#REF!","v":{"$error":"#REF!"}},{"$f":"+Zał.1_WPF_bazowy!#REF!","v":{"$error":"#REF!"}},{"$f":"+Zał.1_WPF_bazowy!#REF!","v":{"$error":"#REF!"}},{"$f":"+Zał.1_WPF_bazowy!#REF!","v":{"$error":"#REF!"}},{"$f":"+Zał.1_WPF_bazowy!#REF!","v":{"$error":"#REF!"}},{"$f":"+Zał.1_WPF_bazowy!#REF!","v":{"$error":"#REF!"}},{"$f":"+Zał.1_WPF_bazowy!#REF!","v":{"$error":"#REF!"}},{"$f":"+Zał.1_WPF_bazowy!#REF!","v":{"$error":"#REF!"}},{"$f":"+Zał.1_WPF_bazowy!#REF!","v":{"$error":"#REF!"}},{"$f":"+Zał.1_WPF_bazowy!#REF!","v":{"$error":"#REF!"}},{"$f":"+Zał.1_WPF_bazowy!#REF!","v":{"$error":"#REF!"}},{"$f":"+Zał.1_WPF_bazowy!#REF!","v":{"$error":"#REF!"}},{"$f":"+Zał.1_WPF_bazowy!#REF!","v":{"$error":"#REF!"}},{"$f":"+Zał.1_WPF_bazowy!#REF!","v":{"$error":"#REF!"}},{"$f":"+Zał.1_WPF_bazowy!#REF!","v":{"$error":"#REF!"}},{"$f":"+Zał.1_WPF_bazowy!#REF!","v":{"$error":"#REF!"}},{"$f":"+Zał.1_WPF_bazowy!#REF!","v":{"$error":"#REF!"}},{"$f":"+Zał.1_WPF_bazowy!#REF!","v":{"$error":"#REF!"}},{"$f":"+Zał.1_WPF_bazowy!#REF!","v":{"$error":"#REF!"}},{"$f":"+Zał.1_WPF_bazowy!#REF!","v":{"$error":"#REF!"}},{"$f":"+Zał.1_WPF_bazowy!#REF!","v":{"$error":"#REF!"}},{"$f":"+Zał.1_WPF_bazowy!#REF!","v":{"$error":"#REF!"}},{"$f":"+Zał.1_WPF_bazowy!#REF!","v":{"$error":"#REF!"}},{"$f":"+Zał.1_WPF_bazowy!#REF!","v":{"$error":"#REF!"}},{"$f":"+Zał.1_WPF_bazowy!#REF!","v":{"$error":"#REF!"}},{"$f":"+Zał.1_WPF_bazowy!#REF!","v":{"$error":"#REF!"}}]
["x","2.1.3",null,"wydatki na obsługę długu, w tym:",{"$f":"Zał.1_WPF_bazowy!E26","v":84758.58},{"$f":"Zał.1_WPF_bazowy!F26","v":36975.83},{"$f":"Zał.1_WPF_bazowy!G26","v":20000},{"$f":"Zał.1_WPF_bazowy!H26","v":20000},{"$f":"+Zał.1_WPF_bazowy!I26","v":100000},{"$f":"+Zał.1_WPF_bazowy!J26","v":70000},{"$f":"+Zał.1_WPF_bazowy!K26","v":34000},{"$f":"+Zał.1_WPF_bazowy!L26","v":0},{"$f":"+Zał.1_WPF_bazowy!#REF!","v":{"$error":"#REF!"}},{"$f":"+Zał.1_WPF_bazowy!#REF!","v":{"$error":"#REF!"}},{"$f":"+Zał.1_WPF_bazowy!#REF!","v":{"$error":"#REF!"}},{"$f":"+Zał.1_WPF_bazowy!#REF!","v":{"$error":"#REF!"}},{"$f":"+Zał.1_WPF_bazowy!#REF!","v":{"$error":"#REF!"}},{"$f":"+Zał.1_WPF_bazowy!#REF!","v":{"$error":"#REF!"}},{"$f":"+Zał.1_WPF_bazowy!#REF!","v":{"$error":"#REF!"}},{"$f":"+Zał.1_WPF_bazowy!#REF!","v":{"$error":"#REF!"}},{"$f":"+Zał.1_WPF_bazowy!#REF!","v":{"$error":"#REF!"}},{"$f":"+Zał.1_WPF_bazowy!#REF!","v":{"$error":"#REF!"}},{"$f":"+Zał.1_WPF_bazowy!#REF!","v":{"$error":"#REF!"}},{"$f":"+Zał.1_WPF_bazowy!#REF!","v":{"$error":"#REF!"}},{"$f":"+Zał.1_WPF_bazowy!#REF!","v":{"$error":"#REF!"}},{"$f":"+Zał.1_WPF_bazowy!#REF!","v":{"$error":"#REF!"}},{"$f":"+Zał.1_WPF_bazowy!#REF!","v":{"$error":"#REF!"}},{"$f":"+Zał.1_WPF_bazowy!#REF!","v":{"$error":"#REF!"}},{"$f":"+Zał.1_WPF_bazowy!#REF!","v":{"$error":"#REF!"}},{"$f":"+Zał.1_WPF_bazowy!#REF!","v":{"$error":"#REF!"}},{"$f":"+Zał.1_WPF_bazowy!#REF!","v":{"$error":"#REF!"}},{"$f":"+Zał.1_WPF_bazowy!#REF!","v":{"$error":"#REF!"}},{"$f":"+Zał.1_WPF_bazowy!#REF!","v":{"$error":"#REF!"}},{"$f":"+Zał.1_WPF_bazowy!#REF!","v":{"$error":"#REF!"}},{"$f":"+Zał.1_WPF_bazowy!#REF!","v":{"$error":"#REF!"}},{"$f":"+Zał.1_WPF_bazowy!#REF!","v":{"$error":"#REF!"}},{"$f":"+Zał.1_WPF_bazowy!#REF!","v":{"$error":"#REF!"}},{"$f":"+Zał.1_WPF_bazowy!#REF!","v":{"$error":"#REF!"}}]
["x","2.1.3.1",null,"odsetki i dyskonto określone w art. 243 ust. 1 ustawy, w tym:",{"$f":"Zał.1_WPF_bazowy!E27","v":83194.59},{"$f":"Zał.1_WPF_bazowy!F27","v":36075.83},{"$f":"Zał.1_WPF_bazowy!G27","v":20000},{"$f":"Zał.1_WPF_bazowy!H27","v":20000},{"$f":"+Zał.1_WPF_bazowy!I27","v":100000},{"$f":"+Zał.1_WPF_bazowy!J27","v":70000},{"$f":"+Zał.1_WPF_bazowy!K27","v":34000},{"$f":"+Zał.1_WPF_bazowy!L27","v":0},{"$f":"+Zał.1_WPF_bazowy!#REF!","v":{"$error":"#REF!"}},{"$f":"+Zał.1_WPF_bazowy!#REF!","v":{"$error":"#REF!"}},{"$f":"+Zał.1_WPF_bazowy!#REF!","v":{"$error":"#REF!"}},{"$f":"+Zał.1_WPF_bazowy!#REF!","v":{"$error":"#REF!"}},{"$f":"+Zał.1_WPF_bazowy!#REF!","v":{"$error":"#REF!"}},{"$f":"+Zał.1_WPF_bazowy!#REF!","v":{"$error":"#REF!"}},{"$f":"+Zał.1_WPF_bazowy!#REF!","v":{"$error":"#REF!"}},{"$f":"+Zał.1_WPF_bazowy!#REF!","v":{"$error":"#REF!"}},{"$f":"+Zał.1_WPF_bazowy!#REF!","v":{"$error":"#REF!"}},{"$f":"+Zał.1_WPF_bazowy!#REF!","v":{"$error":"#REF!"}},{"$f":"+Zał.1_WPF_bazowy!#REF!","v":{"$error":"#REF!"}},{"$f":"+Zał.1_WPF_bazowy!#REF!","v":{"$error":"#REF!"}},{"$f":"+Zał.1_WPF_bazowy!#REF!","v":{"$error":"#REF!"}},{"$f":"+Zał.1_WPF_bazowy!#REF!","v":{"$error":"#REF!"}},{"$f":"+Zał.1_WPF_bazowy!#REF!","v":{"$error":"#REF!"}},{"$f":"+Zał.1_WPF_bazowy!#REF!","v":{"$error":"#REF!"}},{"$f":"+Zał.1_WPF_bazowy!#REF!","v":{"$error":"#REF!"}},{"$f":"+Zał.1_WPF_bazowy!#REF!","v":{"$error":"#REF!"}},{"$f":"+Zał.1_WPF_bazowy!#REF!","v":{"$error":"#REF!"}},{"$f":"+Zał.1_WPF_bazowy!#REF!","v":{"$error":"#REF!"}},{"$f":"+Zał.1_WPF_bazowy!#REF!","v":{"$error":"#REF!"}},{"$f":"+Zał.1_WPF_bazowy!#REF!","v":{"$error":"#REF!"}},{"$f":"+Zał.1_WPF_bazowy!#REF!","v":{"$error":"#REF!"}},{"$f":"+Zał.1_WPF_bazowy!#REF!","v":{"$error":"#REF!"}},{"$f":"+Zał.1_WPF_bazowy!#REF!","v":{"$error":"#REF!"}},{"$f":"+Zał.1_WPF_bazowy!#REF!","v":{"$error":"#REF!"}}]
["x","2.1.3.1.1",null,"odsetki i dyskonto podlegające wyłączeniu z limitu spłaty zobowiązań, o którym mowa w art. 243 ustawy, w terminie nie dłuższym niż 90 dni po zakończeniu programu, projektu lub zadania i otrzymaniu refundacji z tych środków (bez odsetek i dyskonta od zobowiązań na wkład krajowy)",{"$f":"Zał.1_WPF_bazowy!E28","v":0},{"$f":"Zał.1_WPF_bazowy!F28","v":0},{"$f":"Zał.1_WPF_bazowy!G28","v":0},{"$f":"Zał.1_WPF_bazowy!H28","v":0},{"$f":"+Zał.1_WPF_bazowy!I28","v":0},{"$f":"+Zał.1_WPF_bazowy!J28","v":0},{"$f":"+Zał.1_WPF_bazowy!K28","v":0},{"$f":"+Zał.1_WPF_bazowy!L28","v":0},{"$f":"+Zał.1_WPF_bazowy!#REF!","v":{"$error":"#REF!"}},{"$f":"+Zał.1_WPF_bazowy!#REF!","v":{"$error":"#REF!"}},{"$f":"+Zał.1_WPF_bazowy!#REF!","v":{"$error":"#REF!"}},{"$f":"+Zał.1_WPF_bazowy!#REF!","v":{"$error":"#REF!"}},{"$f":"+Zał.1_WPF_bazowy!#REF!","v":{"$error":"#REF!"}},{"$f":"+Zał.1_WPF_bazowy!#REF!","v":{"$error":"#REF!"}},{"$f":"+Zał.1_WPF_bazowy!#REF!","v":{"$error":"#REF!"}},{"$f":"+Zał.1_WPF_bazowy!#REF!","v":{"$error":"#REF!"}},{"$f":"+Zał.1_WPF_bazowy!#REF!","v":{"$error":"#REF!"}},{"$f":"+Zał.1_WPF_bazowy!#REF!","v":{"$error":"#REF!"}},{"$f":"+Zał.1_WPF_bazowy!#REF!","v":{"$error":"#REF!"}},{"$f":"+Zał.1_WPF_bazowy!#REF!","v":{"$error":"#REF!"}},{"$f":"+Zał.1_WPF_bazowy!#REF!","v":{"$error":"#REF!"}},{"$f":"+Zał.1_WPF_bazowy!#REF!","v":{"$error":"#REF!"}},{"$f":"+Zał.1_WPF_bazowy!#REF!","v":{"$error":"#REF!"}},{"$f":"+Zał.1_WPF_bazowy!#REF!","v":{"$error":"#REF!"}},{"$f":"+Zał.1_WPF_bazowy!#REF!","v":{"$error":"#REF!"}},{"$f":"+Zał.1_WPF_bazowy!#REF!","v":{"$error":"#REF!"}},{"$f":"+Zał.1_WPF_bazowy!#REF!","v":{"$error":"#REF!"}},{"$f":"+Zał.1_WPF_bazowy!#REF!","v":{"$error":"#REF!"}},{"$f":"+Zał.1_WPF_bazowy!#REF!","v":{"$error":"#REF!"}},{"$f":"+Zał.1_WPF_bazowy!#REF!","v":{"$error":"#REF!"}},{"$f":"+Zał.1_WPF_bazowy!#REF!","v":{"$error":"#REF!"}},{"$f":"+Zał.1_WPF_bazowy!#REF!","v":{"$error":"#REF!"}},{"$f":"+Zał.1_WPF_bazowy!#REF!","v":{"$error":"#REF!"}},{"$f":"+Zał.1_WPF_bazowy!#REF!","v":{"$error":"#REF!"}}]
["x","2.1.3.1.2",null,"odsetki i dyskonto podlegające wyłączeniu z limitu spłaty zobowiązań, o którym mowa w art. 243 ustawy, z tytułu zobowiązań  zaciągniętych na wkład krajowy",{"$f":"Zał.1_WPF_bazowy!E29","v":0},{"$f":"Zał.1_WPF_bazowy!F29","v":0},{"$f":"Zał.1_WPF_bazowy!G29","v":0},{"$f":"Zał.1_WPF_bazowy!H29","v":0},{"$f":"+Zał.1_WPF_bazowy!I29","v":0},{"$f":"+Zał.1_WPF_bazowy!J29","v":0},{"$f":"+Zał.1_WPF_bazowy!K29","v":0},{"$f":"+Zał.1_WPF_bazowy!L29","v":0},{"$f":"+Zał.1_WPF_bazowy!#REF!","v":{"$error":"#REF!"}},{"$f":"+Zał.1_WPF_bazowy!#REF!","v":{"$error":"#REF!"}},{"$f":"+Zał.1_WPF_bazowy!#REF!","v":{"$error":"#REF!"}},{"$f":"+Zał.1_WPF_bazowy!#REF!","v":{"$error":"#REF!"}},{"$f":"+Zał.1_WPF_bazowy!#REF!","v":{"$error":"#REF!"}},{"$f":"+Zał.1_WPF_bazowy!#REF!","v":{"$error":"#REF!"}},{"$f":"+Zał.1_WPF_bazowy!#REF!","v":{"$error":"#REF!"}},{"$f":"+Zał.1_WPF_bazowy!#REF!","v":{"$error":"#REF!"}},{"$f":"+Zał.1_WPF_bazowy!#REF!","v":{"$error":"#REF!"}},{"$f":"+Zał.1_WPF_bazowy!#REF!","v":{"$error":"#REF!"}},{"$f":"+Zał.1_WPF_bazowy!#REF!","v":{"$error":"#REF!"}},{"$f":"+Zał.1_WPF_bazowy!#REF!","v":{"$error":"#REF!"}},{"$f":"+Zał.1_WPF_bazowy!#REF!","v":{"$error":"#REF!"}},{"$f":"+Zał.1_WPF_bazowy!#REF!","v":{"$error":"#REF!"}},{"$f":"+Zał.1_WPF_bazowy!#REF!","v":{"$error":"#REF!"}},{"$f":"+Zał.1_WPF_bazowy!#REF!","v":{"$error":"#REF!"}},{"$f":"+Zał.1_WPF_bazowy!#REF!","v":{"$error":"#REF!"}},{"$f":"+Zał.1_WPF_bazowy!#REF!","v":{"$error":"#REF!"}},{"$f":"+Zał.1_WPF_bazowy!#REF!","v":{"$error":"#REF!"}},{"$f":"+Zał.1_WPF_bazowy!#REF!","v":{"$error":"#REF!"}},{"$f":"+Zał.1_WPF_bazowy!#REF!","v":{"$error":"#REF!"}},{"$f":"+Zał.1_WPF_bazowy!#REF!","v":{"$error":"#REF!"}},{"$f":"+Zał.1_WPF_bazowy!#REF!","v":{"$error":"#REF!"}},{"$f":"+Zał.1_WPF_bazowy!#REF!","v":{"$error":"#REF!"}},{"$f":"+Zał.1_WPF_bazowy!#REF!","v":{"$error":"#REF!"}},{"$f":"+Zał.1_WPF_bazowy!#REF!","v":{"$error":"#REF!"}}]
["x","2.2",null,"Wydatki majątkowe",{"$f":"Zał.1_WPF_bazowy!E30","v":2425876},{"$f":"Zał.1_WPF_bazowy!F30","v":4393188.7},{"$f":"Zał.1_WPF_bazowy!G30","v":4984247.07},{"$f":"Zał.1_WPF_bazowy!H30","v":4987647.07},{"$f":"+Zał.1_WPF_bazowy!I30","v":3749615},{"$f":"+Zał.1_WPF_bazowy!J30","v":2759990},{"$f":"+Zał.1_WPF_bazowy!K30","v":2725882},{"$f":"+Zał.1_WPF_bazowy!L30","v":3349090},{"$f":"+Zał.1_WPF_bazowy!#REF!","v":{"$error":"#REF!"}},{"$f":"+Zał.1_WPF_bazowy!#REF!","v":{"$error":"#REF!"}},{"$f":"+Zał.1_WPF_bazowy!#REF!","v":{"$error":"#REF!"}},{"$f":"+Zał.1_WPF_bazowy!#REF!","v":{"$error":"#REF!"}},{"$f":"+Zał.1_WPF_bazowy!#REF!","v":{"$error":"#REF!"}},{"$f":"+Zał.1_WPF_bazowy!#REF!","v":{"$error":"#REF!"}},{"$f":"+Zał.1_WPF_bazowy!#REF!","v":{"$error":"#REF!"}},{"$f":"+Zał.1_WPF_bazowy!#REF!","v":{"$error":"#REF!"}},{"$f":"+Zał.1_WPF_bazowy!#REF!","v":{"$error":"#REF!"}},{"$f":"+Zał.1_WPF_bazowy!#REF!","v":{"$error":"#REF!"}},{"$f":"+Zał.1_WPF_bazowy!#REF!","v":{"$error":"#REF!"}},{"$f":"+Zał.1_WPF_bazowy!#REF!","v":{"$error":"#REF!"}},{"$f":"+Zał.1_WPF_bazowy!#REF!","v":{"$error":"#REF!"}},{"$f":"+Zał.1_WPF_bazowy!#REF!","v":{"$error":"#REF!"}},{"$f":"+Zał.1_WPF_bazowy!#REF!","v":{"$error":"#REF!"}},{"$f":"+Zał.1_WPF_bazowy!#REF!","v":{"$error":"#REF!"}},{"$f":"+Zał.1_WPF_bazowy!#REF!","v":{"$error":"#REF!"}},{"$f":"+Zał.1_WPF_bazowy!#REF!","v":{"$error":"#REF!"}},{"$f":"+Zał.1_WPF_bazowy!#REF!","v":{"$error":"#REF!"}},{"$f":"+Zał.1_WPF_bazowy!#REF!","v":{"$error":"#REF!"}},{"$f":"+Zał.1_WPF_bazowy!#REF!","v":{"$error":"#REF!"}},{"$f":"+Zał.1_WPF_bazowy!#REF!","v":{"$error":"#REF!"}},{"$f":"+Zał.1_WPF_bazowy!#REF!","v":{"$error":"#REF!"}},{"$f":"+Zał.1_WPF_bazowy!#REF!","v":{"$error":"#REF!"}},{"$f":"+Zał.1_WPF_bazowy!#REF!","v":{"$error":"#REF!"}},{"$f":"+Zał.1_WPF_bazowy!#REF!","v":{"$error":"#REF!"}}]
["x",3,"[1] -[2]","Wynik budżetu",{"$f":"Zał.1_WPF_bazowy!E31","v":2580481.7200000002},{"$f":"Zał.1_WPF_bazowy!F31","v":-1069250.1399999999},{"$f":"Zał.1_WPF_bazowy!G31","v":102313.19},{"$f":"+H10-H21","v":87813.189999999478},{"$f":"+I10-I21","v":-1233608},{"$f":"+J10-J21","v":701400},701387.59999999963,0,{"$error":"#REF!"},{"$error":"#REF!"},{"$error":"#REF!"},{"$error":"#REF!"},{"$error":"#REF!"},{"$error":"#REF!"},{"$error":"#REF!"},{"$error":"#REF!"},{"$error":"#REF!"},{"$error":"#REF!"},{"$error":"#REF!"},{"$error":"#REF!"},{"$error":"#REF!"},{"$error":"#REF!"},{"$error":"#REF!"},{"$error":"#REF!"},{"$error":"#REF!"},{"$error":"#REF!"},{"$error":"#REF!"},{"$error":"#REF!"},{"$error":"#REF!"},{"$error":"#REF!"},{"$error":"#REF!"},{"$error":"#REF!"},{"$error":"#REF!"},{"$error":"#REF!"}]
["x",4,"[4.1] + [4.2] + [4.3] + [4.4]","Przychody budżetu",{"$f":"Zał.1_WPF_bazowy!E32","v":1050519.3700000001},{"$f":"Zał.1_WPF_bazowy!F32","v":2496104.7400000002},{"$f":"Zał.1_WPF_bazowy!G32","v":696643},{"$f":"+H33+H35+H37+H39","v":541963.4},{"$f":"+I33+I35+I37+I39","v":1402787.6},{"$f":"+J33+J35+J37+J39","v":0},0,0,{"$error":"#REF!"},{"$error":"#REF!"},{"$error":"#REF!"},{"$error":"#REF!"},{"$error":"#REF!"},{"$error":"#REF!"},{"$error":"#REF!"},{"$error":"#REF!"},{"$error":"#REF!"},{"$error":"#REF!"},{"$error":"#REF!"},{"$error":"#REF!"},{"$error":"#REF!"},{"$error":"#REF!"},{"$error":"#REF!"},{"$error":"#REF!"},{"$error":"#REF!"},{"$error":"#REF!"},{"$error":"#REF!"},{"$error":"#REF!"},{"$error":"#REF!"},{"$error":"#REF!"},{"$error":"#REF!"},{"$error":"#REF!"},{"$error":"#REF!"},{"$error":"#REF!"}]
["x","4.1",null,"Nadwyżka budżetowa z lat ubiegłych",{"$f":"Zał.1_WPF_bazowy!E33","v":0},{"$f":"Zał.1_WPF_bazowy!F33","v":959945.09},{"$f":"Zał.1_WPF_bazowy!G33","v":0},{"$f":"Zał.1_WPF_bazowy!H33","v":0},{"$f":"+Zał.1_WPF_bazowy!I33","v":0},{"$f":"+Zał.1_WPF_bazowy!J33","v":0},{"$f":"+Zał.1_WPF_bazowy!K33","v":0},{"$f":"+Zał.1_WPF_bazowy!L33","v":0},{"$f":"+Zał.1_WPF_bazowy!#REF!","v":{"$error":"#REF!"}},{"$f":"+Zał.1_WPF_bazowy!#REF!","v":{"$error":"#REF!"}},{"$f":"+Zał.1_WPF_bazowy!#REF!","v":{"$error":"#REF!"}},{"$f":"+Zał.1_WPF_bazowy!#REF!","v":{"$error":"#REF!"}},{"$f":"+Zał.1_WPF_bazowy!#REF!","v":{"$error":"#REF!"}},{"$f":"+Zał.1_WPF_bazowy!#REF!","v":{"$error":"#REF!"}},{"$f":"+Zał.1_WPF_bazowy!#REF!","v":{"$error":"#REF!"}},{"$f":"+Zał.1_WPF_bazowy!#REF!","v":{"$error":"#REF!"}},{"$f":"+Zał.1_WPF_bazowy!#REF!","v":{"$error":"#REF!"}},{"$f":"+Zał.1_WPF_bazowy!#REF!","v":{"$error":"#REF!"}},{"$f":"+Zał.1_WPF_bazowy!#REF!","v":{"$error":"#REF!"}},{"$f":"+Zał.1_WPF_bazowy!#REF!","v":{"$error":"#REF!"}},{"$f":"+Zał.1_WPF_bazowy!#REF!","v":{"$error":"#REF!"}},{"$f":"+Zał.1_WPF_bazowy!#REF!","v":{"$error":"#REF!"}},{"$f":"+Zał.1_WPF_bazowy!#REF!","v":{"$error":"#REF!"}},{"$f":"+Zał.1_WPF_bazowy!#REF!","v":{"$error":"#REF!"}},{"$f":"+Zał.1_WPF_bazowy!#REF!","v":{"$error":"#REF!"}},{"$f":"+Zał.1_WPF_bazowy!#REF!","v":{"$error":"#REF!"}},{"$f":"+Zał.1_WPF_bazowy!#REF!","v":{"$error":"#REF!"}},{"$f":"+Zał.1_WPF_bazowy!#REF!","v":{"$error":"#REF!"}},{"$f":"+Zał.1_WPF_bazowy!#REF!","v":{"$error":"#REF!"}},{"$f":"+Zał.1_WPF_bazowy!#REF!","v":{"$error":"#REF!"}},{"$f":"+Zał.1_WPF_bazowy!#REF!","v":{"$error":"#REF!"}},{"$f":"+Zał.1_WPF_bazowy!#REF!","v":{"$error":"#REF!"}},{"$f":"+Zał.1_WPF_bazowy!#REF!","v":{"$error":"#REF!"}},{"$f":"+Zał.1_WPF_bazowy!#REF!","v":{"$error":"#REF!"}}]
["x","4.1.1",null,"w tym na pokrycie deficytu budżetu",{"$f":"Zał.1_WPF_bazowy!E34","v":0},{"$f":"Zał.1_WPF_bazowy!F34","v":247105.63},{"$f":"Zał.1_WPF_bazowy!G34","v":0},{"$f":"Zał.1_WPF_bazowy!H34","v":0},{"$f":"+Zał.1_WPF_bazowy!I34","v":0},{"$f":"+Zał.1_WPF_bazowy!J34","v":0},{"$f":"+Zał.1_WPF_bazowy!K34","v":0},{"$f":"+Zał.1_WPF_bazowy!L34","v":0},{"$f":"+Zał.1_WPF_bazowy!#REF!","v":{"$error":"#REF!"}},{"$f":"+Zał.1_WPF_bazowy!#REF!","v":{"$error":"#REF!"}},{"$f":"+Zał.1_WPF_bazowy!#REF!","v":{"$error":"#REF!"}},{"$f":"+Zał.1_WPF_bazowy!#REF!","v":{"$error":"#REF!"}},{"$f":"+Zał.1_WPF_bazowy!#REF!","v":{"$error":"#REF!"}},{"$f":"+Zał.1_WPF_bazowy!#REF!","v":{"$error":"#REF!"}},{"$f":"+Zał.1_WPF_bazowy!#REF!","v":{"$error":"#REF!"}},{"$f":"+Zał.1_WPF_bazowy!#REF!","v":{"$error":"#REF!"}},{"$f":"+Zał.1_WPF_bazowy!#REF!","v":{"$error":"#REF!"}},{"$f":"+Zał.1_WPF_bazowy!#REF!","v":{"$error":"#REF!"}},{"$f":"+Zał.1_WPF_bazowy!#REF!","v":{"$error":"#REF!"}},{"$f":"+Zał.1_WPF_bazowy!#REF!","v":{"$error":"#REF!"}},{"$f":"+Zał.1_WPF_bazowy!#REF!","v":{"$error":"#REF!"}},{"$f":"+Zał.1_WPF_bazowy!#REF!","v":{"$error":"#REF!"}},{"$f":"+Zał.1_WPF_bazowy!#REF!","v":{"$error":"#REF!"}},{"$f":"+Zał.1_WPF_bazowy!#REF!","v":{"$error":"#REF!"}},{"$f":"+Zał.1_WPF_bazowy!#REF!","v":{"$error":"#REF!"}},{"$f":"+Zał.1_WPF_bazowy!#REF!","v":{"$error":"#REF!"}},{"$f":"+Zał.1_WPF_bazowy!#REF!","v":{"$error":"#REF!"}},{"$f":"+Zał.1_WPF_bazowy!#REF!","v":{"$error":"#REF!"}},{"$f":"+Zał.1_WPF_bazowy!#REF!","v":{"$error":"#REF!"}},{"$f":"+Zał.1_WPF_bazowy!#REF!","v":{"$error":"#REF!"}},{"$f":"+Zał.1_WPF_bazowy!#REF!","v":{"$error":"#REF!"}},{"$f":"+Zał.1_WPF_bazowy!#REF!","v":{"$error":"#REF!"}},{"$f":"+Zał.1_WPF_bazowy!#REF!","v":{"$error":"#REF!"}},{"$f":"+Zał.1_WPF_bazowy!#REF!","v":{"$error":"#REF!"}}]
["x","4.2",null,"Wolne środki, o których mowa w art. 217 ust.2 pkt 6 ustawy",{"$f":"Zał.1_WPF_bazowy!E35","v":902519.37},{"$f":"Zał.1_WPF_bazowy!F35","v":1422477.65},{"$f":"Zał.1_WPF_bazowy!G35","v":696643},{"$f":"Zał.1_WPF_bazowy!H35","v":516963.4},{"$f":"+Zał.1_WPF_bazowy!I35","v":0},{"$f":"+Zał.1_WPF_bazowy!J35","v":0},{"$f":"+Zał.1_WPF_bazowy!K35","v":0},{"$f":"+Zał.1_WPF_bazowy!L35","v":0},{"$f":"+Zał.1_WPF_bazowy!#REF!","v":{"$error":"#REF!"}},{"$f":"+Zał.1_WPF_bazowy!#REF!","v":{"$error":"#REF!"}},{"$f":"+Zał.1_WPF_bazowy!#REF!","v":{"$error":"#REF!"}},{"$f":"+Zał.1_WPF_bazowy!#REF!","v":{"$error":"#REF!"}},{"$f":"+Zał.1_WPF_bazowy!#REF!","v":{"$error":"#REF!"}},{"$f":"+Zał.1_WPF_bazowy!#REF!","v":{"$error":"#REF!"}},{"$f":"+Zał.1_WPF_bazowy!#REF!","v":{"$error":"#REF!"}},{"$f":"+Zał.1_WPF_bazowy!#REF!","v":{"$error":"#REF!"}},{"$f":"+Zał.1_WPF_bazowy!#REF!","v":{"$error":"#REF!"}},{"$f":"+Zał.1_WPF_bazowy!#REF!","v":{"$error":"#REF!"}},{"$f":"+Zał.1_WPF_bazowy!#REF!","v":{"$error":"#REF!"}},{"$f":"+Zał.1_WPF_bazowy!#REF!","v":{"$error":"#REF!"}},{"$f":"+Zał.1_WPF_bazowy!#REF!","v":{"$error":"#REF!"}},{"$f":"+Zał.1_WPF_bazowy!#REF!","v":{"$error":"#REF!"}},{"$f":"+Zał.1_WPF_bazowy!#REF!","v":{"$error":"#REF!"}},{"$f":"+Zał.1_WPF_bazowy!#REF!","v":{"$error":"#REF!"}},{"$f":"+Zał.1_WPF_bazowy!#REF!","v":{"$error":"#REF!"}},{"$f":"+Zał.1_WPF_bazowy!#REF!","v":{"$error":"#REF!"}},{"$f":"+Zał.1_WPF_bazowy!#REF!","v":{"$error":"#REF!"}},{"$f":"+Zał.1_WPF_bazowy!#REF!","v":{"$error":"#REF!"}},{"$f":"+Zał.1_WPF_bazowy!#REF!","v":{"$error":"#REF!"}},{"$f":"+Zał.1_WPF_bazowy!#REF!","v":{"$error":"#REF!"}},{"$f":"+Zał.1_WPF_bazowy!#REF!","v":{"$error":"#REF!"}},{"$f":"+Zał.1_WPF_bazowy!#REF!","v":{"$error":"#REF!"}},{"$f":"+Zał.1_WPF_bazowy!#REF!","v":{"$error":"#REF!"}},{"$f":"+Zał.1_WPF_bazowy!#REF!","v":{"$error":"#REF!"}}]
["x","4.2.1",null,"w tym na pokrycie deficytu budżetu",{"$f":"Zał.1_WPF_bazowy!E36","v":0},{"$f":"Zał.1_WPF_bazowy!F36","v":733144.51},{"$f":"Zał.1_WPF_bazowy!G36","v":0},{"$f":"Zał.1_WPF_bazowy!H36","v":0},{"$f":"+Zał.1_WPF_bazowy!I36","v":0},{"$f":"+Zał.1_WPF_bazowy!J36","v":0},{"$f":"+Zał.1_WPF_bazowy!K36","v":0},{"$f":"+Zał.1_WPF_bazowy!L36","v":0},{"$f":"+Zał.1_WPF_bazowy!#REF!","v":{"$error":"#REF!"}},{"$f":"+Zał.1_WPF_bazowy!#REF!","v":{"$error":"#REF!"}},{"$f":"+Zał.1_WPF_bazowy!#REF!","v":{"$error":"#REF!"}},{"$f":"+Zał.1_WPF_bazowy!#REF!","v":{"$error":"#REF!"}},{"$f":"+Zał.1_WPF_bazowy!#REF!","v":{"$error":"#REF!"}},{"$f":"+Zał.1_WPF_bazowy!#REF!","v":{"$error":"#REF!"}},{"$f":"+Zał.1_WPF_bazowy!#REF!","v":{"$error":"#REF!"}},{"$f":"+Zał.1_WPF_bazowy!#REF!","v":{"$error":"#REF!"}},{"$f":"+Zał.1_WPF_bazowy!#REF!","v":{"$error":"#REF!"}},{"$f":"+Zał.1_WPF_bazowy!#REF!","v":{"$error":"#REF!"}},{"$f":"+Zał.1_WPF_bazowy!#REF!","v":{"$error":"#REF!"}},{"$f":"+Zał.1_WPF_bazowy!#REF!","v":{"$error":"#REF!"}},{"$f":"+Zał.1_WPF_bazowy!#REF!","v":{"$error":"#REF!"}},{"$f":"+Zał.1_WPF_bazowy!#REF!","v":{"$error":"#REF!"}},{"$f":"+Zał.1_WPF_bazowy!#REF!","v":{"$error":"#REF!"}},{"$f":"+Zał.1_WPF_bazowy!#REF!","v":{"$error":"#REF!"}},{"$f":"+Zał.1_WPF_bazowy!#REF!","v":{"$error":"#REF!"}},{"$f":"+Zał.1_WPF_bazowy!#REF!","v":{"$error":"#REF!"}},{"$f":"+Zał.1_WPF_bazowy!#REF!","v":{"$error":"#REF!"}},{"$f":"+Zał.1_WPF_bazowy!#REF!","v":{"$error":"#REF!"}},{"$f":"+Zał.1_WPF_bazowy!#REF!","v":{"$error":"#REF!"}},{"$f":"+Zał.1_WPF_bazowy!#REF!","v":{"$error":"#REF!"}},{"$f":"+Zał.1_WPF_bazowy!#REF!","v":{"$error":"#REF!"}},{"$f":"+Zał.1_WPF_bazowy!#REF!","v":{"$error":"#REF!"}},{"$f":"+Zał.1_WPF_bazowy!#REF!","v":{"$error":"#REF!"}},{"$f":"+Zał.1_WPF_bazowy!#REF!","v":{"$error":"#REF!"}}]
["x","4.3",null,"Kredyty, pożyczki, emisja papierów wartościowych",{"$f":"Zał.1_WPF_bazowy!E37","v":148000},{"$f":"Zał.1_WPF_bazowy!F37","v":89000},{"$f":"Zał.1_WPF_bazowy!G37","v":0},{"$f":"Zał.1_WPF_bazowy!H37","v":0},{"$f":"+Zał.1_WPF_bazowy!I37","v":1402787.6},{"$f":"+Zał.1_WPF_bazowy!J37","v":0},{"$f":"+Zał.1_WPF_bazowy!K37","v":0},{"$f":"+Zał.1_WPF_bazowy!L37","v":0},{"$f":"+Zał.1_WPF_bazowy!#REF!","v":{"$error":"#REF!"}},{"$f":"+Zał.1_WPF_bazowy!#REF!","v":{"$error":"#REF!"}},{"$f":"+Zał.1_WPF_bazowy!#REF!","v":{"$error":"#REF!"}},{"$f":"+Zał.1_WPF_bazowy!#REF!","v":{"$error":"#REF!"}},{"$f":"+Zał.1_WPF_bazowy!#REF!","v":{"$error":"#REF!"}},{"$f":"+Zał.1_WPF_bazowy!#REF!","v":{"$error":"#REF!"}},{"$f":"+Zał.1_WPF_bazowy!#REF!","v":{"$error":"#REF!"}},{"$f":"+Zał.1_WPF_bazowy!#REF!","v":{"$error":"#REF!"}},{"$f":"+Zał.1_WPF_bazowy!#REF!","v":{"$error":"#REF!"}},{"$f":"+Zał.1_WPF_bazowy!#REF!","v":{"$error":"#REF!"}},{"$f":"+Zał.1_WPF_bazowy!#REF!","v":{"$error":"#REF!"}},{"$f":"+Zał.1_WPF_bazowy!#REF!","v":{"$error":"#REF!"}},{"$f":"+Zał.1_WPF_bazowy!#REF!","v":{"$error":"#REF!"}},{"$f":"+Zał.1_WPF_bazowy!#REF!","v":{"$error":"#REF!"}},{"$f":"+Zał.1_WPF_bazowy!#REF!","v":{"$error":"#REF!"}},{"$f":"+Zał.1_WPF_bazowy!#REF!","v":{"$error":"#REF!"}},{"$f":"+Zał.1_WPF_bazowy!#REF!","v":{"$error":"#REF!"}},{"$f":"+Zał.1_WPF_bazowy!#REF!","v":{"$error":"#REF!"}},{"$f":"+Zał.1_WPF_bazowy!#REF!","v":{"$error":"#REF!"}},{"$f":"+Zał.1_WPF_bazowy!#REF!","v":{"$error":"#REF!"}},{"$f":"+Zał.1_WPF_bazowy!#REF!","v":{"$error":"#REF!"}},{"$f":"+Zał.1_WPF_bazowy!#REF!","v":{"$error":"#REF!"}},{"$f":"+Zał.1_WPF_bazowy!#REF!","v":{"$error":"#REF!"}},{"$f":"+Zał.1_WPF_bazowy!#REF!","v":{"$error":"#REF!"}},{"$f":"+Zał.1_WPF_bazowy!#REF!","v":{"$error":"#REF!"}},{"$f":"+Zał.1_WPF_bazowy!#REF!","v":{"$error":"#REF!"}}]
["x","4.3.1",null,"w tym na pokrycie deficytu budżetu",{"$f":"Zał.1_WPF_bazowy!E38","v":0},{"$f":"Zał.1_WPF_bazowy!F38","v":89000},{"$f":"Zał.1_WPF_bazowy!G38","v":0},{"$f":"Zał.1_WPF_bazowy!H38","v":0},{"$f":"+Zał.1_WPF_bazowy!I38","v":1233608},{"$f":"+Zał.1_WPF_bazowy!J38","v":0},{"$f":"+Zał.1_WPF_bazowy!K38","v":0},{"$f":"+Zał.1_WPF_bazowy!L38","v":0},{"$f":"+Zał.1_WPF_bazowy!#REF!","v":{"$error":"#REF!"}},{"$f":"+Zał.1_WPF_bazowy!#REF!","v":{"$error":"#REF!"}},{"$f":"+Zał.1_WPF_bazowy!#REF!","v":{"$error":"#REF!"}},{"$f":"+Zał.1_WPF_bazowy!#REF!","v":{"$error":"#REF!"}},{"$f":"+Zał.1_WPF_bazowy!#REF!","v":{"$error":"#REF!"}},{"$f":"+Zał.1_WPF_bazowy!#REF!","v":{"$error":"#REF!"}},{"$f":"+Zał.1_WPF_bazowy!#REF!","v":{"$error":"#REF!"}},{"$f":"+Zał.1_WPF_bazowy!#REF!","v":{"$error":"#REF!"}},{"$f":"+Zał.1_WPF_bazowy!#REF!","v":{"$error":"#REF!"}},{"$f":"+Zał.1_WPF_bazowy!#REF!","v":{"$error":"#REF!"}},{"$f":"+Zał.1_WPF_bazowy!#REF!","v":{"$error":"#REF!"}},{"$f":"+Zał.1_WPF_bazowy!#REF!","v":{"$error":"#REF!"}},{"$f":"+Zał.1_WPF_bazowy!#REF!","v":{"$error":"#REF!"}},{"$f":"+Zał.1_WPF_bazowy!#REF!","v":{"$error":"#REF!"}},{"$f":"+Zał.1_WPF_bazowy!#REF!","v":{"$error":"#REF!"}},{"$f":"+Zał.1_WPF_bazowy!#REF!","v":{"$error":"#REF!"}},{"$f":"+Zał.1_WPF_bazowy!#REF!","v":{"$error":"#REF!"}},{"$f":"+Zał.1_WPF_bazowy!#REF!","v":{"$error":"#REF!"}},{"$f":"+Zał.1_WPF_bazowy!#REF!","v":{"$error":"#REF!"}},{"$f":"+Zał.1_WPF_bazowy!#REF!","v":{"$error":"#REF!"}},{"$f":"+Zał.1_WPF_bazowy!#REF!","v":{"$error":"#REF!"}},{"$f":"+Zał.1_WPF_bazowy!#REF!","v":{"$error":"#REF!"}},{"$f":"+Zał.1_WPF_bazowy!#REF!","v":{"$error":"#REF!"}},{"$f":"+Zał.1_WPF_bazowy!#REF!","v":{"$error":"#REF!"}},{"$f":"+Zał.1_WPF_bazowy!#REF!","v":{"$error":"#REF!"}},{"$f":"+Zał.1_WPF_bazowy!#REF!","v":{"$error":"#REF!"}}]
["x","4.4",null," Inne przychody niezwiązane z zaciągnięciem długu",{"$f":"Zał.1_WPF_bazowy!E39","v":0},{"$f":"Zał.1_WPF_bazowy!F39","v":24682},{"$f":"Zał.1_WPF_bazowy!G39","v":0},{"$f":"Zał.1_WPF_bazowy!H39","v":25000},{"$f":"+Zał.1_WPF_bazowy!I39","v":0},{"$f":"+Zał.1_WPF_bazowy!J39","v":0},{"$f":"+Zał.1_WPF_bazowy!K39","v":0},{"$f":"+Zał.1_WPF_bazowy!L39","v":0},{"$f":"+Zał.1_WPF_bazowy!#REF!","v":{"$error":"#REF!"}},{"$f":"+Zał.1_WPF_bazowy!#REF!","v":{"$error":"#REF!"}},{"$f":"+Zał.1_WPF_bazowy!#REF!","v":{"$error":"#REF!"}},{"$f":"+Zał.1_WPF_bazowy!#REF!","v":{"$error":"#REF!"}},{"$f":"+Zał.1_WPF_bazowy!#REF!","v":{"$error":"#REF!"}},{"$f":"+Zał.1_WPF_bazowy!#REF!","v":{"$error":"#REF!"}},{"$f":"+Zał.1_WPF_bazowy!#REF!","v":{"$error":"#REF!"}},{"$f":"+Zał.1_WPF_bazowy!#REF!","v":{"$error":"#REF!"}},{"$f":"+Zał.1_WPF_bazowy!#REF!","v":{"$error":"#REF!"}},{"$f":"+Zał.1_WPF_bazowy!#REF!","v":{"$error":"#REF!"}},{"$f":"+Zał.1_WPF_bazowy!#REF!","v":{"$error":"#REF!"}},{"$f":"+Zał.1_WPF_bazowy!#REF!","v":{"$error":"#REF!"}},{"$f":"+Zał.1_WPF_bazowy!#REF!","v":{"$error":"#REF!"}},{"$f":"+Zał.1_WPF_bazowy!#REF!","v":{"$error":"#REF!"}},{"$f":"+Zał.1_WPF_bazowy!#REF!","v":{"$error":"#REF!"}},{"$f":"+Zał.1_WPF_bazowy!#REF!","v":{"$error":"#REF!"}},{"$f":"+Zał.1_WPF_bazowy!#REF!","v":{"$error":"#REF!"}},{"$f":"+Zał.1_WPF_bazowy!#REF!","v":{"$error":"#REF!"}},{"$f":"+Zał.1_WPF_bazowy!#REF!","v":{"$error":"#REF!"}},{"$f":"+Zał.1_WPF_bazowy!#REF!","v":{"$error":"#REF!"}},{"$f":"+Zał.1_WPF_bazowy!#REF!","v":{"$error":"#REF!"}},{"$f":"+Zał.1_WPF_bazowy!#REF!","v":{"$error":"#REF!"}},{"$f":"+Zał.1_WPF_bazowy!#REF!","v":{"$error":"#REF!"}},{"$f":"+Zał.1_WPF_bazowy!#REF!","v":{"$error":"#REF!"}},{"$f":"+Zał.1_WPF_bazowy!#REF!","v":{"$error":"#REF!"}},{"$f":"+Zał.1_WPF_bazowy!#REF!","v":{"$error":"#REF!"}}]
["x","4.4.1",null,"w tym na pokrycie deficytu budżetu",{"$f":"Zał.1_WPF_bazowy!E40","v":0},{"$f":"Zał.1_WPF_bazowy!F40","v":0},{"$f":"Zał.1_WPF_bazowy!G40","v":0},{"$f":"Zał.1_WPF_bazowy!H40","v":0},{"$f":"+Zał.1_WPF_bazowy!I40","v":0},{"$f":"+Zał.1_WPF_bazowy!J40","v":0},{"$f":"+Zał.1_WPF_bazowy!K40","v":0},{"$f":"+Zał.1_WPF_bazowy!L40","v":0},{"$f":"+Zał.1_WPF_bazowy!#REF!","v":{"$error":"#REF!"}},{"$f":"+Zał.1_WPF_bazowy!#REF!","v":{"$error":"#REF!"}},{"$f":"+Zał.1_WPF_bazowy!#REF!","v":{"$error":"#REF!"}},{"$f":"+Zał.1_WPF_bazowy!#REF!","v":{"$error":"#REF!"}},{"$f":"+Zał.1_WPF_bazowy!#REF!","v":{"$error":"#REF!"}},{"$f":"+Zał.1_WPF_bazowy!#REF!","v":{"$error":"#REF!"}},{"$f":"+Zał.1_WPF_bazowy!#REF!","v":{"$error":"#REF!"}},{"$f":"+Zał.1_WPF_bazowy!#REF!","v":{"$error":"#REF!"}},{"$f":"+Zał.1_WPF_bazowy!#REF!","v":{"$error":"#REF!"}},{"$f":"+Zał.1_WPF_bazowy!#REF!","v":{"$error":"#REF!"}},{"$f":"+Zał.1_WPF_bazowy!#REF!","v":{"$error":"#REF!"}},{"$f":"+Zał.1_WPF_bazowy!#REF!","v":{"$error":"#REF!"}},{"$f":"+Zał.1_WPF_bazowy!#REF!","v":{"$error":"#REF!"}},{"$f":"+Zał.1_WPF_bazowy!#REF!","v":{"$error":"#REF!"}},{"$f":"+Zał.1_WPF_bazowy!#REF!","v":{"$error":"#REF!"}},{"$f":"+Zał.1_WPF_bazowy!#REF!","v":{"$error":"#REF!"}},{"$f":"+Zał.1_WPF_bazowy!#REF!","v":{"$error":"#REF!"}},{"$f":"+Zał.1_WPF_bazowy!#REF!","v":{"$error":"#REF!"}},{"$f":"+Zał.1_WPF_bazowy!#REF!","v":{"$error":"#REF!"}},{"$f":"+Zał.1_WPF_bazowy!#REF!","v":{"$error":"#REF!"}},{"$f":"+Zał.1_WPF_bazowy!#REF!","v":{"$error":"#REF!"}},{"$f":"+Zał.1_WPF_bazowy!#REF!","v":{"$error":"#REF!"}},{"$f":"+Zał.1_WPF_bazowy!#REF!","v":{"$error":"#REF!"}},{"$f":"+Zał.1_WPF_bazowy!#REF!","v":{"$error":"#REF!"}},{"$f":"+Zał.1_WPF_bazowy!#REF!","v":{"$error":"#REF!"}},{"$f":"+Zał.1_WPF_bazowy!#REF!","v":{"$error":"#REF!"}}]
["x",5,"[5.1] + [5.2]","Rozchody budżetu",{"$f":"Zał.1_WPF_bazowy!E41","v":1303202.75},{"$f":"Zał.1_WPF_bazowy!F41","v":737521.46},{"$f":"Zał.1_WPF_bazowy!G41","v":798956.19},{"$f":"+H42+H47","v":629776.59},169179.6,701400,701387.6,0,{"$error":"#REF!"},{"$error":"#REF!"},{"$error":"#REF!"},{"$error":"#REF!"},{"$error":"#REF!"},{"$error":"#REF!"},{"$error":"#REF!"},{"$error":"#REF!"},{"$error":"#REF!"},{"$error":"#REF!"},{"$error":"#REF!"},{"$error":"#REF!"},{"$error":"#REF!"},{"$error":"#REF!"},{"$error":"#REF!"},{"$error":"#REF!"},{"$error":"#REF!"},{"$error":"#REF!"},{"$error":"#REF!"},{"$error":"#REF!"},{"$error":"#REF!"},{"$error":"#REF!"},{"$error":"#REF!"},{"$error":"#REF!"},{"$error":"#REF!"},{"$error":"#REF!"}]
["x","5.1",null,"Spłaty rat kapitałowych kredytów i pożyczek oraz wykup papierów wartościowych",{"$f":"Zał.1_WPF_bazowy!E42","v":1278520.75},{"$f":"Zał.1_WPF_bazowy!F42","v":737521.46},{"$f":"Zał.1_WPF_bazowy!G42","v":773956.19},{"$f":"Zał.1_WPF_bazowy!H42","v":604776.59},{"$f":"+Zał.1_WPF_bazowy!I42","v":169179.6},{"$f":"+Zał.1_WPF_bazowy!J42","v":701400},{"$f":"+Zał.1_WPF_bazowy!K42","v":701387.6},{"$f":"+Zał.1_WPF_bazowy!L42","v":0},{"$f":"+Zał.1_WPF_bazowy!#REF!","v":{"$error":"#REF!"}},{"$f":"+Zał.1_WPF_bazowy!#REF!","v":{"$error":"#REF!"}},{"$f":"+Zał.1_WPF_bazowy!#REF!","v":{"$error":"#REF!"}},{"$f":"+Zał.1_WPF_bazowy!#REF!","v":{"$error":"#REF!"}},{"$f":"+Zał.1_WPF_bazowy!#REF!","v":{"$error":"#REF!"}},{"$f":"+Zał.1_WPF_bazowy!#REF!","v":{"$error":"#REF!"}},{"$f":"+Zał.1_WPF_bazowy!#REF!","v":{"$error":"#REF!"}},{"$f":"+Zał.1_WPF_bazowy!#REF!","v":{"$error":"#REF!"}},{"$f":"+Zał.1_WPF_bazowy!#REF!","v":{"$error":"#REF!"}},{"$f":"+Zał.1_WPF_bazowy!#REF!","v":{"$error":"#REF!"}},{"$f":"+Zał.1_WPF_bazowy!#REF!","v":{"$error":"#REF!"}},{"$f":"+Zał.1_WPF_bazowy!#REF!","v":{"$error":"#REF!"}},{"$f":"+Zał.1_WPF_bazowy!#REF!","v":{"$error":"#REF!"}},{"$f":"+Zał.1_WPF_bazowy!#REF!","v":{"$error":"#REF!"}},{"$f":"+Zał.1_WPF_bazowy!#REF!","v":{"$error":"#REF!"}},{"$f":"+Zał.1_WPF_bazowy!#REF!","v":{"$error":"#REF!"}},{"$f":"+Zał.1_WPF_bazowy!#REF!","v":{"$error":"#REF!"}},{"$f":"+Zał.1_WPF_bazowy!#REF!","v":{"$error":"#REF!"}},{"$f":"+Zał.1_WPF_bazowy!#REF!","v":{"$error":"#REF!"}},{"$f":"+Zał.1_WPF_bazowy!#REF!","v":{"$error":"#REF!"}},{"$f":"+Zał.1_WPF_bazowy!#REF!","v":{"$error":"#REF!"}},{"$f":"+Zał.1_WPF_bazowy!#REF!","v":{"$error":"#REF!"}},{"$f":"+Zał.1_WPF_bazowy!#REF!","v":{"$error":"#REF!"}},{"$f":"+Zał.1_WPF_bazowy!#REF!","v":{"$error":"#REF!"}},{"$f":"+Zał.1_WPF_bazowy!#REF!","v":{"$error":"#REF!"}},{"$f":"+Zał.1_WPF_bazowy!#REF!","v":{"$error":"#REF!"}}]
["x","5.1.1","[5.1.1.1] + [5.1.1.2] + [5.1.1.3]","w tym łączna kwota przypadających na dany rok kwot ustawowych wyłączeń z limitu spłaty zobowiązań, o którym mowa w art. 243 ustawy, z tego:",{"$f":"Zał.1_WPF_bazowy!E43","v":595645.15},{"$f":"Zał.1_WPF_bazowy!F43","v":0},{"$f":"Zał.1_WPF_bazowy!G43","v":89000},{"$f":"+H44+H45+H46","v":89000},{"$f":"+I44+I45+I46","v":0},0,0,0,{"$error":"#REF!"},{"$error":"#REF!"},{"$error":"#REF!"},{"$error":"#REF!"},{"$error":"#REF!"},{"$error":"#REF!"},{"$error":"#REF!"},{"$error":"#REF!"},{"$error":"#REF!"},{"$error":"#REF!"},{"$error":"#REF!"},{"$error":"#REF!"},{"$error":"#REF!"},{"$error":"#REF!"},{"$error":"#REF!"},{"$error":"#REF!"},{"$error":"#REF!"},{"$error":"#REF!"},{"$error":"#REF!"},{"$error":"#REF!"},{"$error":"#REF!"},{"$error":"#REF!"},{"$error":"#REF!"},{"$error":"#REF!"},{"$error":"#REF!"},{"$error":"#REF!"}]
["x","5.1.1.1",null,"kwota przypadających na dany rok kwot ustawowych wyłączeń określonych w art. 243 ust. 3 ustawy",{"$f":"Zał.1_WPF_bazowy!E44","v":595645.15},{"$f":"Zał.1_WPF_bazowy!F44","v":0},{"$f":"Zał.1_WPF_bazowy!G44","v":89000},{"$f":"Zał.1_WPF_bazowy!H44","v":89000},{"$f":"+Zał.1_WPF_bazowy!I44","v":0},{"$f":"+Zał.1_WPF_bazowy!J44","v":0},{"$f":"+Zał.1_WPF_bazowy!K44","v":0},{"$f":"+Zał.1_WPF_bazowy!L44","v":0},{"$f":"+Zał.1_WPF_bazowy!#REF!","v":{"$error":"#REF!"}},{"$f":"+Zał.1_WPF_bazowy!#REF!","v":{"$error":"#REF!"}},{"$f":"+Zał.1_WPF_bazowy!#REF!","v":{"$error":"#REF!"}},{"$f":"+Zał.1_WPF_bazowy!#REF!","v":{"$error":"#REF!"}},{"$f":"+Zał.1_WPF_bazowy!#REF!","v":{"$error":"#REF!"}},{"$f":"+Zał.1_WPF_bazowy!#REF!","v":{"$error":"#REF!"}},{"$f":"+Zał.1_WPF_bazowy!#REF!","v":{"$error":"#REF!"}},{"$f":"+Zał.1_WPF_bazowy!#REF!","v":{"$error":"#REF!"}},{"$f":"+Zał.1_WPF_bazowy!#REF!","v":{"$error":"#REF!"}},{"$f":"+Zał.1_WPF_bazowy!#REF!","v":{"$error":"#REF!"}},{"$f":"+Zał.1_WPF_bazowy!#REF!","v":{"$error":"#REF!"}},{"$f":"+Zał.1_WPF_bazowy!#REF!","v":{"$error":"#REF!"}},{"$f":"+Zał.1_WPF_bazowy!#REF!","v":{"$error":"#REF!"}},{"$f":"+Zał.1_WPF_bazowy!#REF!","v":{"$error":"#REF!"}},{"$f":"+Zał.1_WPF_bazowy!#REF!","v":{"$error":"#REF!"}},{"$f":"+Zał.1_WPF_bazowy!#REF!","v":{"$error":"#REF!"}},{"$f":"+Zał.1_WPF_bazowy!#REF!","v":{"$error":"#REF!"}},{"$f":"+Zał.1_WPF_bazowy!#REF!","v":{"$error":"#REF!"}},{"$f":"+Zał.1_WPF_bazowy!#REF!","v":{"$error":"#REF!"}},{"$f":"+Zał.1_WPF_bazowy!#REF!","v":{"$error":"#REF!"}},{"$f":"+Zał.1_WPF_bazowy!#REF!","v":{"$error":"#REF!"}},{"$f":"+Zał.1_WPF_bazowy!#REF!","v":{"$error":"#REF!"}},{"$f":"+Zał.1_WPF_bazowy!#REF!","v":{"$error":"#REF!"}},{"$f":"+Zał.1_WPF_bazowy!#REF!","v":{"$error":"#REF!"}},{"$f":"+Zał.1_WPF_bazowy!#REF!","v":{"$error":"#REF!"}},{"$f":"+Zał.1_WPF_bazowy!#REF!","v":{"$error":"#REF!"}}]
["x","5.1.1.2",null,"kwota przypadających na dany rok kwot ustawowych wyłączeń określonych w art. 243 ust. 3a ustawy",{"$f":"Zał.1_WPF_bazowy!E45","v":0},{"$f":"Zał.1_WPF_bazowy!F45","v":0},{"$f":"Zał.1_WPF_bazowy!G45","v":0},{"$f":"Zał.1_WPF_bazowy!H45","v":0},{"$f":"+Zał.1_WPF_bazowy!I45","v":0},{"$f":"+Zał.1_WPF_bazowy!J45","v":0},{"$f":"+Zał.1_WPF_bazowy!K45","v":0},{"$f":"+Zał.1_WPF_bazowy!L45","v":0},{"$f":"+Zał.1_WPF_bazowy!#REF!","v":{"$error":"#REF!"}},{"$f":"+Zał.1_WPF_bazowy!#REF!","v":{"$error":"#REF!"}},{"$f":"+Zał.1_WPF_bazowy!#REF!","v":{"$error":"#REF!"}},{"$f":"+Zał.1_WPF_bazowy!#REF!","v":{"$error":"#REF!"}},{"$f":"+Zał.1_WPF_bazowy!#REF!","v":{"$error":"#REF!"}},{"$f":"+Zał.1_WPF_bazowy!#REF!","v":{"$error":"#REF!"}},{"$f":"+Zał.1_WPF_bazowy!#REF!","v":{"$error":"#REF!"}},{"$f":"+Zał.1_WPF_bazowy!#REF!","v":{"$error":"#REF!"}},{"$f":"+Zał.1_WPF_bazowy!#REF!","v":{"$error":"#REF!"}},{"$f":"+Zał.1_WPF_bazowy!#REF!","v":{"$error":"#REF!"}},{"$f":"+Zał.1_WPF_bazowy!#REF!","v":{"$error":"#REF!"}},{"$f":"+Zał.1_WPF_bazowy!#REF!","v":{"$error":"#REF!"}},{"$f":"+Zał.1_WPF_bazowy!#REF!","v":{"$error":"#REF!"}},{"$f":"+Zał.1_WPF_bazowy!#REF!","v":{"$error":"#REF!"}},{"$f":"+Zał.1_WPF_bazowy!#REF!","v":{"$error":"#REF!"}},{"$f":"+Zał.1_WPF_bazowy!#REF!","v":{"$error":"#REF!"}},{"$f":"+Zał.1_WPF_bazowy!#REF!","v":{"$error":"#REF!"}},{"$f":"+Zał.1_WPF_bazowy!#REF!","v":{"$error":"#REF!"}},{"$f":"+Zał.1_WPF_bazowy!#REF!","v":{"$error":"#REF!"}},{"$f":"+Zał.1_WPF_bazowy!#REF!","v":{"$error":"#REF!"}},{"$f":"+Zał.1_WPF_bazowy!#REF!","v":{"$error":"#REF!"}},{"$f":"+Zał.1_WPF_bazowy!#REF!","v":{"$error":"#REF!"}},{"$f":"+Zał.1_WPF_bazowy!#REF!","v":{"$error":"#REF!"}},{"$f":"+Zał.1_WPF_bazowy!#REF!","v":{"$error":"#REF!"}},{"$f":"+Zał.1_WPF_bazowy!#REF!","v":{"$error":"#REF!"}},{"$f":"+Zał.1_WPF_bazowy!#REF!","v":{"$error":"#REF!"}}]
["x","5.1.1.3",null,"kwota przypadających na dany rok kwot ustawowych wyłączeń innych niż określone w art. 243 ustawy",{"$f":"Zał.1_WPF_bazowy!E46","v":0},{"$f":"Zał.1_WPF_bazowy!F46","v":0},{"$f":"Zał.1_WPF_bazowy!G46","v":0},{"$f":"Zał.1_WPF_bazowy!H46","v":0},{"$f":"+Zał.1_WPF_bazowy!I46","v":0},{"$f":"+Zał.1_WPF_bazowy!J46","v":0},{"$f":"+Zał.1_WPF_bazowy!K46","v":0},{"$f":"+Zał.1_WPF_bazowy!L46","v":0},{"$f":"+Zał.1_WPF_bazowy!#REF!","v":{"$error":"#REF!"}},{"$f":"+Zał.1_WPF_bazowy!#REF!","v":{"$error":"#REF!"}},{"$f":"+Zał.1_WPF_bazowy!#REF!","v":{"$error":"#REF!"}},{"$f":"+Zał.1_WPF_bazowy!#REF!","v":{"$error":"#REF!"}},{"$f":"+Zał.1_WPF_bazowy!#REF!","v":{"$error":"#REF!"}},{"$f":"+Zał.1_WPF_bazowy!#REF!","v":{"$error":"#REF!"}},{"$f":"+Zał.1_WPF_bazowy!#REF!","v":{"$error":"#REF!"}},{"$f":"+Zał.1_WPF_bazowy!#REF!","v":{"$error":"#REF!"}},{"$f":"+Zał.1_WPF_bazowy!#REF!","v":{"$error":"#REF!"}},{"$f":"+Zał.1_WPF_bazowy!#REF!","v":{"$error":"#REF!"}},{"$f":"+Zał.1_WPF_bazowy!#REF!","v":{"$error":"#REF!"}},{"$f":"+Zał.1_WPF_bazowy!#REF!","v":{"$error":"#REF!"}},{"$f":"+Zał.1_WPF_bazowy!#REF!","v":{"$error":"#REF!"}},{"$f":"+Zał.1_WPF_bazowy!#REF!","v":{"$error":"#REF!"}},{"$f":"+Zał.1_WPF_bazowy!#REF!","v":{"$error":"#REF!"}},{"$f":"+Zał.1_WPF_bazowy!#REF!","v":{"$error":"#REF!"}},{"$f":"+Zał.1_WPF_bazowy!#REF!","v":{"$error":"#REF!"}},{"$f":"+Zał.1_WPF_bazowy!#REF!","v":{"$error":"#REF!"}},{"$f":"+Zał.1_WPF_bazowy!#REF!","v":{"$error":"#REF!"}},{"$f":"+Zał.1_WPF_bazowy!#REF!","v":{"$error":"#REF!"}},{"$f":"+Zał.1_WPF_bazowy!#REF!","v":{"$error":"#REF!"}},{"$f":"+Zał.1_WPF_bazowy!#REF!","v":{"$error":"#REF!"}},{"$f":"+Zał.1_WPF_bazowy!#REF!","v":{"$error":"#REF!"}},{"$f":"+Zał.1_WPF_bazowy!#REF!","v":{"$error":"#REF!"}},{"$f":"+Zał.1_WPF_bazowy!#REF!","v":{"$error":"#REF!"}},{"$f":"+Zał.1_WPF_bazowy!#REF!","v":{"$error":"#REF!"}}]
[null,"5.2",null," Inne rozchody niezwiązane ze spłatą długu",{"$f":"Zał.1_WPF_bazowy!E47","v":24682},{"$f":"Zał.1_WPF_bazowy!F47","v":0},{"$f":"Zał.1_WPF_bazowy!G47","v":25000},{"$f":"Zał.1_WPF_bazowy!H47","v":25000},{"$f":"+Zał.1_WPF_bazowy!I47","v":0},{"$f":"+Zał.1_WPF_bazowy!J47","v":0},{"$f":"+Zał.1_WPF_bazowy!K47","v":0},{"$f":"+Zał.1_WPF_bazowy!L47","v":0},{"$f":"+Zał.1_WPF_bazowy!#REF!","v":{"$error":"#REF!"}},{"$f":"+Zał.1_WPF_bazowy!#REF!","v":{"$error":"#REF!"}},{"$f":"+Zał.1_WPF_bazowy!#REF!","v":{"$error":"#REF!"}},{"$f":"+Zał.1_WPF_bazowy!#REF!","v":{"$error":"#REF!"}},{"$f":"+Zał.1_WPF_bazowy!#REF!","v":{"$error":"#REF!"}},{"$f":"+Zał.1_WPF_bazowy!#REF!","v":{"$error":"#REF!"}},{"$f":"+Zał.1_WPF_bazowy!#REF!","v":{"$error":"#REF!"}},{"$f":"+Zał.1_WPF_bazowy!#REF!","v":{"$error":"#REF!"}},{"$f":"+Zał.1_WPF_bazowy!#REF!","v":{"$error":"#REF!"}},{"$f":"+Zał.1_WPF_bazowy!#REF!","v":{"$error":"#REF!"}},{"$f":"+Zał.1_WPF_bazowy!#REF!","v":{"$error":"#REF!"}},{"$f":"+Zał.1_WPF_bazowy!#REF!","v":{"$error":"#REF!"}},{"$f":"+Zał.1_WPF_bazowy!#REF!","v":{"$error":"#REF!"}},{"$f":"+Zał.1_WPF_bazowy!#REF!","v":{"$error":"#REF!"}},{"$f":"+Zał.1_WPF_bazowy!#REF!","v":{"$error":"#REF!"}},{"$f":"+Zał.1_WPF_bazowy!#REF!","v":{"$error":"#REF!"}},{"$f":"+Zał.1_WPF_bazowy!#REF!","v":{"$error":"#REF!"}},{"$f":"+Zał.1_WPF_bazowy!#REF!","v":{"$error":"#REF!"}},{"$f":"+Zał.1_WPF_bazowy!#REF!","v":{"$error":"#REF!"}},{"$f":"+Zał.1_WPF_bazowy!#REF!","v":{"$error":"#REF!"}},{"$f":"+Zał.1_WPF_bazowy!#REF!","v":{"$error":"#REF!"}},{"$f":"+Zał.1_WPF_bazowy!#REF!","v":{"$error":"#REF!"}},{"$f":"+Zał.1_WPF_bazowy!#REF!","v":{"$error":"#REF!"}},{"$f":"+Zał.1_WPF_bazowy!#REF!","v":{"$error":"#REF!"}},{"$f":"+Zał.1_WPF_bazowy!#REF!","v":{"$error":"#REF!"}},{"$f":"+Zał.1_WPF_bazowy!#REF!","v":{"$error":"#REF!"}}]
["x",6,null,"Kwota długu",{"$f":"Zał.1_WPF_bazowy!E48","v":1422477.65},{"$f":"Zał.1_WPF_bazowy!F48","v":773956.19},{"$f":"Zał.1_WPF_bazowy!G48","v":0},{"$f":"Zał.1_WPF_bazowy!H48","v":169179.6},{"$f":"+IF(I10<>0,H48+I37-I42+(I105-H105)+I110,0)","v":1402787.6},701387.60000000009,1.1641532182693481E-10,1.1641532182693481E-10,{"$error":"#REF!"},{"$error":"#REF!"},{"$error":"#REF!"},{"$error":"#REF!"},{"$error":"#REF!"},{"$error":"#REF!"},{"$error":"#REF!"},{"$error":"#REF!"},{"$error":"#REF!"},{"$error":"#REF!"},{"$error":"#REF!"},{"$error":"#REF!"},{"$error":"#REF!"},{"$error":"#REF!"},{"$error":"#REF!"},{"$error":"#REF!"},{"$error":"#REF!"},{"$error":"#REF!"},{"$error":"#REF!"},{"$error":"#REF!"},{"$error":"#REF!"},{"$error":"#REF!"},{"$error":"#REF!"},{"$error":"#REF!"},{"$error":"#REF!"},{"$error":"#REF!"}]
[null,7,null,"Kwota zobowiązań wynikających z przejęcia przez jednostkę samorządu terytorialnego zobowiązań po likwidowanych i przekształcanych jednostkach zaliczanych do sektora  finansów publicznych",{"$f":"Zał.1_WPF_bazowy!E49","v":0},{"$f":"Zał.1_WPF_bazowy!F49","v":0},{"$f":"Zał.1_WPF_bazowy!G49","v":0},{"$f":"Zał.1_WPF_bazowy!H49","v":0},{"$f":"+Zał.1_WPF_bazowy!I49","v":0},{"$f":"+Zał.1_WPF_bazowy!J49","v":0},{"$f":"+Zał.1_WPF_bazowy!K49","v":0},{"$f":"+Zał.1_WPF_bazowy!L49","v":0},{"$f":"+Zał.1_WPF_bazowy!#REF!","v":{"$error":"#REF!"}},{"$f":"+Zał.1_WPF_bazowy!#REF!","v":{"$error":"#REF!"}},{"$f":"+Zał.1_WPF_bazowy!#REF!","v":{"$error":"#REF!"}},{"$f":"+Zał.1_WPF_bazowy!#REF!","v":{"$error":"#REF!"}},{"$f":"+Zał.1_WPF_bazowy!#REF!","v":{"$error":"#REF!"}},{"$f":"+Zał.1_WPF_bazowy!#REF!","v":{"$error":"#REF!"}},{"$f":"+Zał.1_WPF_bazowy!#REF!","v":{"$error":"#REF!"}},{"$f":"+Zał.1_WPF_bazowy!#REF!","v":{"$error":"#REF!"}},{"$f":"+Zał.1_WPF_bazowy!#REF!","v":{"$error":"#REF!"}},{"$f":"+Zał.1_WPF_bazowy!#REF!","v":{"$error":"#REF!"}},{"$f":"+Zał.1_WPF_bazowy!#REF!","v":{"$error":"#REF!"}},{"$f":"+Zał.1_WPF_bazowy!#REF!","v":{"$error":"#REF!"}},{"$f":"+Zał.1_WPF_bazowy!#REF!","v":{"$error":"#REF!"}},{"$f":"+Zał.1_WPF_bazowy!#REF!","v":{"$error":"#REF!"}},{"$f":"+Zał.1_WPF_bazowy!#REF!","v":{"$error":"#REF!"}},{"$f":"+Zał.1_WPF_bazowy!#REF!","v":{"$error":"#REF!"}},{"$f":"+Zał.1_WPF_bazowy!#REF!","v":{"$error":"#REF!"}},{"$f":"+Zał.1_WPF_bazowy!#REF!","v":{"$error":"#REF!"}},{"$f":"+Zał.1_WPF_bazowy!#REF!","v":{"$error":"#REF!"}},{"$f":"+Zał.1_WPF_bazowy!#REF!","v":{"$error":"#REF!"}},{"$f":"+Zał.1_WPF_bazowy!#REF!","v":{"$error":"#REF!"}},{"$f":"+Zał.1_WPF_bazowy!#REF!","v":{"$error":"#REF!"}},{"$f":"+Zał.1_WPF_bazowy!#REF!","v":{"$error":"#REF!"}},{"$f":"+Zał.1_WPF_bazowy!#REF!","v":{"$error":"#REF!"}},{"$f":"+Zał.1_WPF_bazowy!#REF!","v":{"$error":"#REF!"}},{"$f":"+Zał.1_WPF_bazowy!#REF!","v":{"$error":"#REF!"}}]
[null,8,null,"Relacja zrównoważenia wydatków bieżących, o której mowa w art. 242 ustawy","x","x","x","x","x","x","x","x","x","x","x","x","x","x","x","x","x","x","x","x","x","x","x","x","x","x","x","x","x","x","x","x","x","x"]
[null,"8.1","[1.1] - [2.1]","Różnica między dochodami bieżącymi a  wydatkami bieżącymi",{"$f":"Zał.1_WPF_bazowy!E51","v":3604694.11},{"$f":"Zał.1_WPF_bazowy!F51","v":2583957.89},{"$f":"Zał.1_WPF_bazowy!G51","v":2204241.19},{"$f":"+H11-H22","v":2193141.1899999995},2508107,3461390,3427269.5999999996,3349090,{"$error":"#REF!"},{"$error":"#REF!"},{"$error":"#REF!"},{"$error":"#REF!"},{"$error":"#REF!"},{"$error":"#REF!"},{"$error":"#REF!"},{"$error":"#REF!"},{"$error":"#REF!"},{"$error":"#REF!"},{"$error":"#REF!"},{"$error":"#REF!"},{"$error":"#REF!"},{"$error":"#REF!"},{"$error":"#REF!"},{"$error":"#REF!"},{"$error":"#REF!"},{"$error":"#REF!"},{"$error":"#REF!"},{"$error":"#REF!"},{"$error":"#REF!"},{"$error":"#REF!"},{"$error":"#REF!"},{"$error":"#REF!"},{"$error":"#REF!"},{"$error":"#REF!"}]
[null,"8.2","[1.1] + [4.1] + [4.2] - (  [2.1] - [2.1.2]  )","Różnica między dochodami bieżącymi, skorygowanymi o środki a wydatkami bieżącymi, pomniejszonymi  o wydatki",{"$f":"+IF(AND(E9>=2013,E9<=2015),+E11+E33+E35-(E22-E25),+E11+E33+E35-E22)","v":4507213.4799999986},4966380.6300000008,2900884.1900000013,2710104.59,2508107,3461390,3427269.5999999996,3349090,{"$error":"#REF!"},{"$error":"#REF!"},{"$error":"#REF!"},{"$error":"#REF!"},{"$error":"#REF!"},{"$error":"#REF!"},{"$error":"#REF!"},{"$error":"#REF!"},{"$error":"#REF!"},{"$error":"#REF!"},{"$error":"#REF!"},{"$error":"#REF!"},{"$error":"#REF!"},{"$error":"#REF!"},{"$error":"#REF!"},{"$error":"#REF!"},{"$error":"#REF!"},{"$error":"#REF!"},{"$error":"#REF!"},{"$error":"#REF!"},{"$error":"#REF!"},{"$error":"#REF!"},{"$error":"#REF!"},{"$error":"#REF!"},{"$error":"#REF!"},{"$error":"#REF!"}]
["x",9,null,"Wskaźnik spłaty zobowiązań","x","x","x","x","x","x","x","x","x","x","x","x","x","x","x","x","x","x","x","x","x","x","x","x","x","x","x","x","x","x","x","x","x","x"]
["x","9.1","([2.1.1] + [2.1.3.1] + [5.1] ) / [1]","Wskaźnik planowanej łącznej kwoty spłaty zobowiązań, o której mowa w art. 243 ust. 1 ustawy do dochodów, bez uwzględnienia zobowiązań związku współtworzonego przez jednostkę samorządu terytorialnego  i bez uwzględnienia ustawowych wyłączeń przypadających na dany rok.",{"$f":"Zał.1_WPF_bazowy!E54","v":9.6799999999999997E-2},{"$f":"Zał.1_WPF_bazowy!F54","v":6.0900000000000003E-2},{"$f":"Zał.1_WPF_bazowy!G54","v":5.2600000000000001E-2},{"$f":"+IF(H10<>0,ROUND((H23+H27+H42)/H10,$K$7+2),\"-\")","v":4.0500000000000001E-2},2.2599999999999999E-2,5.8799999999999998E-2,5.5500000000000001E-2,0,{"$error":"#REF!"},{"$error":"#REF!"},{"$error":"#REF!"},{"$error":"#REF!"},{"$error":"#REF!"},{"$error":"#REF!"},{"$error":"#REF!"},{"$error":"#REF!"},{"$error":"#REF!"},{"$error":"#REF!"},{"$error":"#REF!"},{"$error":"#REF!"},{"$error":"#REF!"},{"$error":"#REF!"},{"$error":"#REF!"},{"$error":"#REF!"},{"$error":"#REF!"},{"$error":"#REF!"},{"$error":"#REF!"},{"$error":"#REF!"},{"$error":"#REF!"},{"$error":"#REF!"},{"$error":"#REF!"},{"$error":"#REF!"},{"$error":"#REF!"},{"$error":"#REF!"}]
["x","9.2","( ([2.1.1]-[2.1.1.1])+([2.1.3.1]-[2.1.3.1.1]-[2.1.3.1.2])+([5.1]-[5.1.1]) )/([1]-[15.1.1])","Wskaźnik planowanej łącznej kwoty spłaty zobowiązań, o której mowa w art. 243 ust. 1 ustawy do dochodów, bez uwzględnienia zobowiązań związku współtworzonego przez jednostkę samorządu terytorialnego, po uwzględnieniu ustawowych wyłączeń przypadających na dany rok.",{"$f":"Zał.1_WPF_bazowy!E55","v":5.45E-2},{"$f":"Zał.1_WPF_bazowy!F55","v":6.0900000000000003E-2},{"$f":"Zał.1_WPF_bazowy!G55","v":4.6699999999999998E-2},{"$f":"+IF(H10<>0,ROUND((H23-H24+H27-H28-H29+H42-H43)/(H10-H113),$K$7+2),\"-\")","v":3.4799999999999998E-2},{"$f":"+IF(I10<>0,ROUND((I23-I24+I27-I28-I29+I42-I43)/(I10-I113),$K$7+2),\"-\")","v":2.2599999999999999E-2},5.8799999999999998E-2,5.5500000000000001E-2,0,{"$error":"#REF!"},{"$error":"#REF!"},{"$error":"#REF!"},{"$error":"#REF!"},{"$error":"#REF!"},{"$error":"#REF!"},{"$error":"#REF!"},{"$error":"#REF!"},{"$error":"#REF!"},{"$error":"#REF!"},{"$error":"#REF!"},{"$error":"#REF!"},{"$error":"#REF!"},{"$error":"#REF!"},{"$error":"#REF!"},{"$error":"#REF!"},{"$error":"#REF!"},{"$error":"#REF!"},{"$error":"#REF!"},{"$error":"#REF!"},{"$error":"#REF!"},{"$error":"#REF!"},{"$error":"#REF!"},{"$error":"#REF!"},{"$error":"#REF!"},{"$error":"#REF!"}]
["x","9.3",null,"Kwota zobowiązań związku współtworzonego przez jednostkę samorządu terytorialnego przypadających do spłaty w danym roku budżetowym, podlegająca doliczeniu zgodnie z art. 244 ustawy",{"$f":"Zał.1_WPF_bazowy!E56","v":0},{"$f":"Zał.1_WPF_bazowy!F56","v":0},{"$f":"Zał.1_WPF_bazowy!G56","v":0},{"$f":"Zał.1_WPF_bazowy!H56","v":0},{"$f":"+Zał.1_WPF_bazowy!I56","v":0},{"$f":"+Zał.1_WPF_bazowy!J56","v":0},{"$f":"+Zał.1_WPF_bazowy!K56","v":0},{"$f":"+Zał.1_WPF_bazowy!L56","v":0},{"$f":"+Zał.1_WPF_bazowy!#REF!","v":{"$error":"#REF!"}},{"$f":"+Zał.1_WPF_bazowy!#REF!","v":{"$error":"#REF!"}},{"$f":"+Zał.1_WPF_bazowy!#REF!","v":{"$error":"#REF!"}},{"$f":"+Zał.1_WPF_bazowy!#REF!","v":{"$error":"#REF!"}},{"$f":"+Zał.1_WPF_bazowy!#REF!","v":{"$error":"#REF!"}},{"$f":"+Zał.1_WPF_bazowy!#REF!","v":{"$error":"#REF!"}},{"$f":"+Zał.1_WPF_bazowy!#REF!","v":{"$error":"#REF!"}},{"$f":"+Zał.1_WPF_bazowy!#REF!","v":{"$error":"#REF!"}},{"$f":"+Zał.1_WPF_bazowy!#REF!","v":{"$error":"#REF!"}},{"$f":"+Zał.1_WPF_bazowy!#REF!","v":{"$error":"#REF!"}},{"$f":"+Zał.1_WPF_bazowy!#REF!","v":{"$error":"#REF!"}},{"$f":"+Zał.1_WPF_bazowy!#REF!","v":{"$error":"#REF!"}},{"$f":"+Zał.1_WPF_bazowy!#REF!","v":{"$error":"#REF!"}},{"$f":"+Zał.1_WPF_bazowy!#REF!","v":{"$error":"#REF!"}},{"$f":"+Zał.1_WPF_bazowy!#REF!","v":{"$error":"#REF!"}},{"$f":"+Zał.1_WPF_bazowy!#REF!","v":{"$error":"#REF!"}},{"$f":"+Zał.1_WPF_bazowy!#REF!","v":{"$error":"#REF!"}},{"$f":"+Zał.1_WPF_bazowy!#REF!","v":{"$error":"#REF!"}},{"$f":"+Zał.1_WPF_bazowy!#REF!","v":{"$error":"#REF!"}},{"$f":"+Zał.1_WPF_bazowy!#REF!","v":{"$error":"#REF!"}},{"$f":"+Zał.1_WPF_bazowy!#REF!","v":{"$error":"#REF!"}},{"$f":"+Zał.1_WPF_bazowy!#REF!","v":{"$error":"#REF!"}},{"$f":"+Zał.1_WPF_bazowy!#REF!","v":{"$error":"#REF!"}},{"$f":"+Zał.1_WPF_bazowy!#REF!","v":{"$error":"#REF!"}},{"$f":"+Zał.1_WPF_bazowy!#REF!","v":{"$error":"#REF!"}},{"$f":"+Zał.1_WPF_bazowy!#REF!","v":{"$error":"#REF!"}}]
["x","9.4","(([2.1.1]-[2.1.1.1]) + ([2.1.3.1]-[2.1.3.1.1]-[2.1.3.1.2])+([5.1]-[5.1.1])+[9.3]) /([1]-[15.1.1])","Wskaźnik planowanej łącznej kwoty spłaty zobowiązań, o której mowa w art. 243 ust. 1 ustawy do dochodów, po uwzględnieniu zobowiązań związku współtworzonego przez jednostkę samorządu terytorialnego oraz po uwzględnieniu ustawowych wyłączeń przypadających na dany rok",{"$f":"Zał.1_WPF_bazowy!E57","v":5.45E-2},{"$f":"Zał.1_WPF_bazowy!F57","v":6.0900000000000003E-2},{"$f":"Zał.1_WPF_bazowy!G57","v":4.6699999999999998E-2},{"$f":"+IF(H10<>0,ROUND((H23-H24+H27-H28-H29+H42-H43+H56)/(H10-H113),$K$7+2),\"-\")","v":3.4799999999999998E-2},{"$f":"+IF(I10<>0,ROUND((I23-I24+I27-I28-I29+I42-I43+I56)/(I10-I113),$K$7+2),\"-\")","v":2.2599999999999999E-2},5.8799999999999998E-2,5.5500000000000001E-2,0,{"$error":"#REF!"},{"$error":"#REF!"},{"$error":"#REF!"},{"$error":"#REF!"},{"$error":"#REF!"},{"$error":"#REF!"},{"$error":"#REF!"},{"$error":"#REF!"},{"$error":"#REF!"},{"$error":"#REF!"},{"$error":"#REF!"},{"$error":"#REF!"},{"$error":"#REF!"},{"$error":"#REF!"},{"$error":"#REF!"},{"$error":"#REF!"},{"$error":"#REF!"},{"$error":"#REF!"},{"$error":"#REF!"},{"$error":"#REF!"},{"$error":"#REF!"},{"$error":"#REF!"},{"$error":"#REF!"},{"$error":"#REF!"},{"$error":"#REF!"},{"$error":"#REF!"}]
["x","9.5","(([1.1] - [15.1.1])+[1.2.1] - ([2.1]-[2.1.2]-[15.2]))/ ([1]-[15.1.1])","Wskaźnik dochodów bieżących powiększonych o dochody ze sprzedaży majątku oraz pomniejszonych o wydatki bieżące, do dochodów budżetu, ustalony dla danego roku (wskaźnik jednoroczny)",{"$f":"+ROUND(IF(AND(E9>=2013,E9<=2018),IF(E10<>0,(E11-E113+E19-E22+E25+E114)/(E10-E113),0),IF(E10<>0,(E11-E113+E19-E22+E114)/(E10-E113),0)),$K$7+2)","v":0.26129999999999998},{"$f":"+ROUND(IF(AND(F9>=2013,F9<=2018),IF(F10<>0,(F11-F113+F19-F22+F25+F114)/(F10-F113),0),IF(F10<>0,(F11-F113+F19-F22+F114)/(F10-F113),0)),$K$7+2)","v":0.20380000000000001},0.16070000000000001,0.15659999999999999,0.21099999999999999,0.26390000000000002,0.25869999999999999,0.25030000000000002,{"$error":"#REF!"},{"$error":"#REF!"},{"$error":"#REF!"},{"$error":"#REF!"},{"$error":"#REF!"},{"$error":"#REF!"},{"$error":"#REF!"},{"$error":"#REF!"},{"$error":"#REF!"},{"$error":"#REF!"},{"$error":"#REF!"},{"$error":"#REF!"},{"$error":"#REF!"},{"$error":"#REF!"},{"$error":"#REF!"},{"$error":"#REF!"},{"$error":"#REF!"},{"$error":"#REF!"},{"$error":"#REF!"},{"$error":"#REF!"},{"$error":"#REF!"},{"$error":"#REF!"},{"$error":"#REF!"},{"$error":"#REF!"},{"$error":"#REF!"},{"$error":"#REF!"}]
["x","9.6","średnia z trzech poprzednich lat [9.5]","Dopuszczalny wskaźnik spłaty zobowiązań określony w art. 243 ustawy, po uwzględnieniu ustawowych wyłączeń , obliczony w oparciu o plan 3 kwartału roku poprzedzającego pierwszy rok prognozy (wskaźnik ustalony w oparciu o średnią arytmetyczną z 3 poprzednich lat) ",{"$f":"Zał.1_WPF_bazowy!E59","v":"x"},{"$f":"Zał.1_WPF_bazowy!F59","v":"x"},{"$f":"Zał.1_WPF_bazowy!G59","v":"x"},{"$f":"Zał.1_WPF_bazowy!H59","v":"x"},{"$f":"+IF(I10<>0,(G58+F58+E58)/3,\"-\")","v":0.20860000000000001},{"$f":"+IF(J10<>0,(I58+G58+F58)/3,\"-\")","v":0.19183333333333333},{"$f":"+IF(K10<>0,(J58+I58+G58)/3,\"-\")","v":0.21186666666666665},{"$f":"+IF(L10<>0,(K58+J58+I58)/3,\"-\")","v":0.2445333333333333},{"$error":"#REF!"},{"$error":"#REF!"},{"$error":"#REF!"},{"$error":"#REF!"},{"$error":"#REF!"},{"$error":"#REF!"},{"$error":"#REF!"},{"$error":"#REF!"},{"$error":"#REF!"},{"$error":"#REF!"},{"$error":"#REF!"},{"$error":"#REF!"},{"$error":"#REF!"},{"$error":"#REF!"},{"$error":"#REF!"},{"$error":"#REF!"},{"$error":"#REF!"},{"$error":"#REF!"},{"$error":"#REF!"},{"$error":"#REF!"},{"$error":"#REF!"},{"$error":"#REF!"},{"$error":"#REF!"},{"$error":"#REF!"},{"$error":"#REF!"},{"$error":"#REF!"}]
["x","9.6.1","średnia z trzech poprzednich lat [9.5]","Dopuszczalny wskaźnik spłaty zobowiązań określony w art. 243 ustawy, po uwzględnieniu ustawowych wyłączeń, obliczony w oparciu o wykonanie roku poprzedzającego pierwszy rok prognozy (wskaźnik ustalony w oparciu o średnią arytmetyczną z 3 poprzednich lat) ",{"$f":"Zał.1_WPF_bazowy!E60","v":"x"},{"$f":"Zał.1_WPF_bazowy!F60","v":"x"},{"$f":"Zał.1_WPF_bazowy!G60","v":"x"},{"$f":"Zał.1_WPF_bazowy!H60","v":"x"},{"$f":"+IF(I10<>0,ROUND((H58+F58+E58)/3,$K$7+2),\"-\")","v":0.2072},{"$f":"+IF(J10<>0,ROUND((I58+H58+F58)/3,$K$7+2),\"-\")","v":0.1905},{"$f":"+IF(K10<>0,ROUND((J58+I58+H58)/3,$K$7+2),\"-\")","v":0.21049999999999999},0.2445,{"$error":"#REF!"},{"$error":"#REF!"},{"$error":"#REF!"},{"$error":"#REF!"},{"$error":"#REF!"},{"$error":"#REF!"},{"$error":"#REF!"},{"$error":"#REF!"},{"$error":"#REF!"},{"$error":"#REF!"},{"$error":"#REF!"},{"$error":"#REF!"},{"$error":"#REF!"},{"$error":"#REF!"},{"$error":"#REF!"},{"$error":"#REF!"},{"$error":"#REF!"},{"$error":"#REF!"},{"$error":"#REF!"},{"$error":"#REF!"},{"$error":"#REF!"},{"$error":"#REF!"},{"$error":"#REF!"},{"$error":"#REF!"},{"$error":"#REF!"},{"$error":"#REF!"}]
["x","9.7","[9.4]-[9.6]","Informacja o spełnieniu wskaźnika spłaty zobowiązań określonego w art. 243 ustawy, po uwzględnieniu zobowiązań związku współtworzonego przez jednostkę samorządu terytorialnego oraz po uwzględnieniu ustawowych wyłączeń, obliczonego w oparciu o plan 3 kwartałów roku poprzedzającego rok budżetowy",{"$f":"Zał.1_WPF_bazowy!E61","v":"x"},{"$f":"Zał.1_WPF_bazowy!F61","v":"x"},{"$f":"Zał.1_WPF_bazowy!G61","v":"x"},{"$f":"Zał.1_WPF_bazowy!H61","v":"x"},{"$f":"+IF(I10<>0,IF(I59>=I57,\"Spełniona\",\"Nie spełniona\"),\"-\")","v":"Spełniona"},"Spełniona","Spełniona","Spełniona",{"$error":"#REF!"},{"$error":"#REF!"},{"$error":"#REF!"},{"$error":"#REF!"},{"$error":"#REF!"},{"$error":"#REF!"},{"$error":"#REF!"},{"$error":"#REF!"},{"$error":"#REF!"},{"$error":"#REF!"},{"$error":"#REF!"},{"$error":"#REF!"},{"$error":"#REF!"},{"$error":"#REF!"},{"$error":"#REF!"},{"$error":"#REF!"},{"$error":"#REF!"},{"$error":"#REF!"},{"$error":"#REF!"},{"$error":"#REF!"},{"$error":"#REF!"},{"$error":"#REF!"},{"$error":"#REF!"},{"$error":"#REF!"},{"$error":"#REF!"},{"$error":"#REF!"}]
["x","9.7.1","[9.4]-[9.6.1]","Informacja o spełnieniu wskaźnika spłaty zobowiązań określonego w art. 243 ustawy, po uwzględnieniu zobowiązań związku współtworzonego przez jednostkę samorządu terytorialnego oraz po uwzględnieniu ustawowych wyłączeń, obliczonego w oparciu o wykonanie roku poprzedzającego rok budżetowy",{"$f":"Zał.1_WPF_bazowy!E62","v":"x"},{"$f":"Zał.1_WPF_bazowy!F62","v":"x"},{"$f":"Zał.1_WPF_bazowy!G62","v":"x"},{"$f":"Zał.1_WPF_bazowy!H62","v":"x"},{"$f":"+IF(I10<>0,IF(I60>=I57,\"Spełniona\",\"Nie spełniona\"),\"-\")","v":"Spełniona"},"Spełniona","Spełniona","Spełniona",{"$error":"#REF!"},{"$error":"#REF!"},{"$error":"#REF!"},{"$error":"#REF!"},{"$error":"#REF!"},{"$error":"#REF!"},{"$error":"#REF!"},{"$error":"#REF!"},{"$error":"#REF!"},{"$error":"#REF!"},{"$error":"#REF!"},{"$error":"#REF!"},{"$error":"#REF!"},{"$error":"#REF!"},{"$error":"#REF!"},{"$error":"#REF!"},{"$error":"#REF!"},{"$error":"#REF!"},{"$error":"#REF!"},{"$error":"#REF!"},{"$error":"#REF!"},{"$error":"#REF!"},{"$error":"#REF!"},{"$error":"#REF!"},{"$error":"#REF!"},{"$error":"#REF!"}]
[null,10,null,"Przeznaczenie prognozowanej nadwyżki budżetowej,  w tym na:",{"$f":"Zał.1_WPF_bazowy!E63","v":0},{"$f":"Zał.1_WPF_bazowy!F63","v":0},{"$f":"Zał.1_WPF_bazowy!G63","v":0},{"$f":"Zał.1_WPF_bazowy!H63","v":0},{"$f":"+Zał.1_WPF_bazowy!I63","v":0},{"$f":"+Zał.1_WPF_bazowy!J63","v":701400},{"$f":"+Zał.1_WPF_bazowy!K63","v":701387.6},{"$f":"+Zał.1_WPF_bazowy!L63","v":0},{"$f":"+Zał.1_WPF_bazowy!#REF!","v":{"$error":"#REF!"}},{"$f":"+Zał.1_WPF_bazowy!#REF!","v":{"$error":"#REF!"}},{"$f":"+Zał.1_WPF_bazowy!#REF!","v":{"$error":"#REF!"}},{"$f":"+Zał.1_WPF_bazowy!#REF!","v":{"$error":"#REF!"}},{"$f":"+Zał.1_WPF_bazowy!#REF!","v":{"$error":"#REF!"}},{"$f":"+Zał.1_WPF_bazowy!#REF!","v":{"$error":"#REF!"}},{"$f":"+Zał.1_WPF_bazowy!#REF!","v":{"$error":"#REF!"}},{"$f":"+Zał.1_WPF_bazowy!#REF!","v":{"$error":"#REF!"}},{"$f":"+Zał.1_WPF_bazowy!#REF!","v":{"$error":"#REF!"}},{"$f":"+Zał.1_WPF_bazowy!#REF!","v":{"$error":"#REF!"}},{"$f":"+Zał.1_WPF_bazowy!#REF!","v":{"$error":"#REF!"}},{"$f":"+Zał.1_WPF_bazowy!#REF!","v":{"$error":"#REF!"}},{"$f":"+Zał.1_WPF_bazowy!#REF!","v":{"$error":"#REF!"}},{"$f":"+Zał.1_WPF_bazowy!#REF!","v":{"$error":"#REF!"}},{"$f":"+Zał.1_WPF_bazowy!#REF!","v":{"$error":"#REF!"}},{"$f":"+Zał.1_WPF_bazowy!#REF!","v":{"$error":"#REF!"}},{"$f":"+Zał.1_WPF_bazowy!#REF!","v":{"$error":"#REF!"}},{"$f":"+Zał.1_WPF_bazowy!#REF!","v":{"$error":"#REF!"}},{"$f":"+Zał.1_WPF_bazowy!#REF!","v":{"$error":"#REF!"}},{"$f":"+Zał.1_WPF_bazowy!#REF!","v":{"$error":"#REF!"}},{"$f":"+Zał.1_WPF_bazowy!#REF!","v":{"$error":"#REF!"}},{"$f":"+Zał.1_WPF_bazowy!#REF!","v":{"$error":"#REF!"}},{"$f":"+Zał.1_WPF_bazowy!#REF!","v":{"$error":"#REF!"}},{"$f":"+Zał.1_WPF_bazowy!#REF!","v":{"$error":"#REF!"}},{"$f":"+Zał.1_WPF_bazowy!#REF!","v":{"$error":"#REF!"}},{"$f":"+Zał.1_WPF_bazowy!#REF!","v":{"$error":"#REF!"}}]
[null,"10.1",null,"Spłaty kredytów, pożyczek i wykup papierów wartościowych",{"$f":"Zał.1_WPF_bazowy!E64","v":0},{"$f":"Zał.1_WPF_bazowy!F64","v":0},{"$f":"Zał.1_WPF_bazowy!G64","v":102313.19},{"$f":"Zał.1_WPF_bazowy!H64","v":87813.19},{"$f":"+Zał.1_WPF_bazowy!I64","v":0},{"$f":"+Zał.1_WPF_bazowy!J64","v":701400},{"$f":"+Zał.1_WPF_bazowy!K64","v":701387.6},{"$f":"+Zał.1_WPF_bazowy!L64","v":0},{"$f":"+Zał.1_WPF_bazowy!#REF!","v":{"$error":"#REF!"}},{"$f":"+Zał.1_WPF_bazowy!#REF!","v":{"$error":"#REF!"}},{"$f":"+Zał.1_WPF_bazowy!#REF!","v":{"$error":"#REF!"}},{"$f":"+Zał.1_WPF_bazowy!#REF!","v":{"$error":"#REF!"}},{"$f":"+Zał.1_WPF_bazowy!#REF!","v":{"$error":"#REF!"}},{"$f":"+Zał.1_WPF_bazowy!#REF!","v":{"$error":"#REF!"}},{"$f":"+Zał.1_WPF_bazowy!#REF!","v":{"$error":"#REF!"}},{"$f":"+Zał.1_WPF_bazowy!#REF!","v":{"$error":"#REF!"}},{"$f":"+Zał.1_WPF_bazowy!#REF!","v":{"$error":"#REF!"}},{"$f":"+Zał.1_WPF_bazowy!#REF!","v":{"$error":"#REF!"}},{"$f":"+Zał.1_WPF_bazowy!#REF!","v":{"$error":"#REF!"}},{"$f":"+Zał.1_WPF_bazowy!#REF!","v":{"$error":"#REF!"}},{"$f":"+Zał.1_WPF_bazowy!#REF!","v":{"$error":"#REF!"}},{"$f":"+Zał.1_WPF_bazowy!#REF!","v":{"$error":"#REF!"}},{"$f":"+Zał.1_WPF_bazowy!#REF!","v":{"$error":"#REF!"}},{"$f":"+Zał.1_WPF_bazowy!#REF!","v":{"$error":"#REF!"}},{"$f":"+Zał.1_WPF_bazowy!#REF!","v":{"$error":"#REF!"}},{"$f":"+Zał.1_WPF_bazowy!#REF!","v":{"$error":"#REF!"}},{"$f":"+Zał.1_WPF_bazowy!#REF!","v":{"$error":"#REF!"}},{"$f":"+Zał.1_WPF_bazowy!#REF!","v":{"$error":"#REF!"}},{"$f":"+Zał.1_WPF_bazowy!#REF!","v":{"$error":"#REF!"}},{"$f":"+Zał.1_WPF_bazowy!#REF!","v":{"$error":"#REF!"}},{"$f":"+Zał.1_WPF_bazowy!#REF!","v":{"$error":"#REF!"}},{"$f":"+Zał.1_WPF_bazowy!#REF!","v":{"$error":"#REF!"}},{"$f":"+Zał.1_WPF_bazowy!#REF!","v":{"$error":"#REF!"}},{"$f":"+Zał.1_WPF_bazowy!#REF!","v":{"$error":"#REF!"}}]
[null,11,null,"Informacje uzupełniające o wybranych rodzajach wydatków budżetowych","x","x","x","x","x","x","x","x","x","x","x","x","x","x","x","x","x","x","x","x","x","x","x","x","x","x","x","x","x","x","x","x","x","x"]
[null,"11.1",null,"Wydatki bieżące na wynagrodzenia i składki od nich naliczane",{"$f":"Zał.1_WPF_bazowy!E66","v":4171528.09},{"$f":"Zał.1_WPF_bazowy!F66","v":4149289.86},{"$f":"Zał.1_WPF_bazowy!G66","v":4357418.68},{"$f":"Zał.1_WPF_bazowy!H66","v":4359798.43},{"$f":"+Zał.1_WPF_bazowy!I66","v":4417511},{"$f":"+Zał.1_WPF_bazowy!J66","v":4519114},{"$f":"+Zał.1_WPF_bazowy!K66","v":4614015},{"$f":"+Zał.1_WPF_bazowy!L66","v":4729365},{"$f":"+Zał.1_WPF_bazowy!#REF!","v":{"$error":"#REF!"}},{"$f":"+Zał.1_WPF_bazowy!#REF!","v":{"$error":"#REF!"}},{"$f":"+Zał.1_WPF_bazowy!#REF!","v":{"$error":"#REF!"}},{"$f":"+Zał.1_WPF_bazowy!#REF!","v":{"$error":"#REF!"}},{"$f":"+Zał.1_WPF_bazowy!#REF!","v":{"$error":"#REF!"}},{"$f":"+Zał.1_WPF_bazowy!#REF!","v":{"$error":"#REF!"}},{"$f":"+Zał.1_WPF_bazowy!#REF!","v":{"$error":"#REF!"}},{"$f":"+Zał.1_WPF_bazowy!#REF!","v":{"$error":"#REF!"}},{"$f":"+Zał.1_WPF_bazowy!#REF!","v":{"$error":"#REF!"}},{"$f":"+Zał.1_WPF_bazowy!#REF!","v":{"$error":"#REF!"}},{"$f":"+Zał.1_WPF_bazowy!#REF!","v":{"$error":"#REF!"}},{"$f":"+Zał.1_WPF_bazowy!#REF!","v":{"$error":"#REF!"}},{"$f":"+Zał.1_WPF_bazowy!#REF!","v":{"$error":"#REF!"}},{"$f":"+Zał.1_WPF_bazowy!#REF!","v":{"$error":"#REF!"}},{"$f":"+Zał.1_WPF_bazowy!#REF!","v":{"$error":"#REF!"}},{"$f":"+Zał.1_WPF_bazowy!#REF!","v":{"$error":"#REF!"}},{"$f":"+Zał.1_WPF_bazowy!#REF!","v":{"$error":"#REF!"}},{"$f":"+Zał.1_WPF_bazowy!#REF!","v":{"$error":"#REF!"}},{"$f":"+Zał.1_WPF_bazowy!#REF!","v":{"$error":"#REF!"}},{"$f":"+Zał.1_WPF_bazowy!#REF!","v":{"$error":"#REF!"}},{"$f":"+Zał.1_WPF_bazowy!#REF!","v":{"$error":"#REF!"}},{"$f":"+Zał.1_WPF_bazowy!#REF!","v":{"$error":"#REF!"}},{"$f":"+Zał.1_WPF_bazowy!#REF!","v":{"$error":"#REF!"}},{"$f":"+Zał.1_WPF_bazowy!#REF!","v":{"$error":"#REF!"}},{"$f":"+Zał.1_WPF_bazowy!#REF!","v":{"$error":"#REF!"}},{"$f":"+Zał.1_WPF_bazowy!#REF!","v":{"$error":"#REF!"}}]
[null,"11.2",null,"Wydatki związane z funkcjonowaniem organów jednostki samorządu terytorialnego",{"$f":"Zał.1_WPF_bazowy!E67","v":1438877.18},{"$f":"Zał.1_WPF_bazowy!F67","v":1343112.1},{"$f":"Zał.1_WPF_bazowy!G67","v":1571198},{"$f":"Zał.1_WPF_bazowy!H67","v":1571198},{"$f":"+Zał.1_WPF_bazowy!I67","v":1539639},{"$f":"+Zał.1_WPF_bazowy!J67","v":1575050},{"$f":"+Zał.1_WPF_bazowy!K67","v":1608127},{"$f":"+Zał.1_WPF_bazowy!L67","v":1648330},{"$f":"+Zał.1_WPF_bazowy!#REF!","v":{"$error":"#REF!"}},{"$f":"+Zał.1_WPF_bazowy!#REF!","v":{"$error":"#REF!"}},{"$f":"+Zał.1_WPF_bazowy!#REF!","v":{"$error":"#REF!"}},{"$f":"+Zał.1_WPF_bazowy!#REF!","v":{"$error":"#REF!"}},{"$f":"+Zał.1_WPF_bazowy!#REF!","v":{"$error":"#REF!"}},{"$f":"+Zał.1_WPF_bazowy!#REF!","v":{"$error":"#REF!"}},{"$f":"+Zał.1_WPF_bazowy!#REF!","v":{"$error":"#REF!"}},{"$f":"+Zał.1_WPF_bazowy!#REF!","v":{"$error":"#REF!"}},{"$f":"+Zał.1_WPF_bazowy!#REF!","v":{"$error":"#REF!"}},{"$f":"+Zał.1_WPF_bazowy!#REF!","v":{"$error":"#REF!"}},{"$f":"+Zał.1_WPF_bazowy!#REF!","v":{"$error":"#REF!"}},{"$f":"+Zał.1_WPF_bazowy!#REF!","v":{"$error":"#REF!"}},{"$f":"+Zał.1_WPF_bazowy!#REF!","v":{"$error":"#REF!"}},{"$f":"+Zał.1_WPF_bazowy!#REF!","v":{"$error":"#REF!"}},{"$f":"+Zał.1_WPF_bazowy!#REF!","v":{"$error":"#REF!"}},{"$f":"+Zał.1_WPF_bazowy!#REF!","v":{"$error":"#REF!"}},{"$f":"+Zał.1_WPF_bazowy!#REF!","v":{"$error":"#REF!"}},{"$f":"+Zał.1_WPF_bazowy!#REF!","v":{"$error":"#REF!"}},{"$f":"+Zał.1_WPF_bazowy!#REF!","v":{"$error":"#REF!"}},{"$f":"+Zał.1_WPF_bazowy!#REF!","v":{"$error":"#REF!"}},{"$f":"+Zał.1_WPF_bazowy!#REF!","v":{"$error":"#REF!"}},{"$f":"+Zał.1_WPF_bazowy!#REF!","v":{"$error":"#REF!"}},{"$f":"+Zał.1_WPF_bazowy!#REF!","v":{"$error":"#REF!"}},{"$f":"+Zał.1_WPF_bazowy!#REF!","v":{"$error":"#REF!"}},{"$f":"+Zał.1_WPF_bazowy!#REF!","v":{"$error":"#REF!"}},{"$f":"+Zał.1_WPF_bazowy!#REF!","v":{"$error":"#REF!"}}]
[null,"11.3","[11.3.1] + [11.3.2]","Wydatki objęte limitem, o którym mowa w art. 226 ust. 3 pkt 4 ustawy",{"$f":"Zał.1_WPF_bazowy!E68","v":718974.51},{"$f":"Zał.1_WPF_bazowy!F68","v":3319528.6},{"$f":"Zał.1_WPF_bazowy!G68","v":352571.38},{"$f":"+H69+H70","v":352571.38},{"$f":"+I69+I70","v":945000},{"$f":"+J69+J70","v":1405000},0,0,{"$error":"#REF!"},{"$error":"#REF!"},{"$error":"#REF!"},{"$error":"#REF!"},{"$error":"#REF!"},{"$error":"#REF!"},{"$error":"#REF!"},{"$error":"#REF!"},{"$error":"#REF!"},{"$error":"#REF!"},{"$error":"#REF!"},{"$error":"#REF!"},{"$error":"#REF!"},{"$error":"#REF!"},{"$error":"#REF!"},{"$error":"#REF!"},{"$error":"#REF!"},{"$error":"#REF!"},{"$error":"#REF!"},{"$error":"#REF!"},{"$error":"#REF!"},{"$error":"#REF!"},{"$error":"#REF!"},{"$error":"#REF!"},{"$error":"#REF!"},{"$error":"#REF!"}]
[null,"11.3.1",null,"bieżące",{"$f":"Zał.1_WPF_bazowy!E69","v":156869.10999999999},{"$f":"Zał.1_WPF_bazowy!F69","v":138833.24},{"$f":"Zał.1_WPF_bazowy!G69","v":227234.31},{"$f":"Zał.1_WPF_bazowy!H69","v":227234.31},{"$f":"+Zał.1_WPF_bazowy!I69","v":0},{"$f":"+Zał.1_WPF_bazowy!J69","v":0},{"$f":"+Zał.1_WPF_bazowy!K69","v":0},{"$f":"+Zał.1_WPF_bazowy!L69","v":0},{"$f":"+Zał.1_WPF_bazowy!#REF!","v":{"$error":"#REF!"}},{"$f":"+Zał.1_WPF_bazowy!#REF!","v":{"$error":"#REF!"}},{"$f":"+Zał.1_WPF_bazowy!#REF!","v":{"$error":"#REF!"}},{"$f":"+Zał.1_WPF_bazowy!#REF!","v":{"$error":"#REF!"}},{"$f":"+Zał.1_WPF_bazowy!#REF!","v":{"$error":"#REF!"}},{"$f":"+Zał.1_WPF_bazowy!#REF!","v":{"$error":"#REF!"}},{"$f":"+Zał.1_WPF_bazowy!#REF!","v":{"$error":"#REF!"}},{"$f":"+Zał.1_WPF_bazowy!#REF!","v":{"$error":"#REF!"}},{"$f":"+Zał.1_WPF_bazowy!#REF!","v":{"$error":"#REF!"}},{"$f":"+Zał.1_WPF_bazowy!#REF!","v":{"$error":"#REF!"}},{"$f":"+Zał.1_WPF_bazowy!#REF!","v":{"$error":"#REF!"}},{"$f":"+Zał.1_WPF_bazowy!#REF!","v":{"$error":"#REF!"}},{"$f":"+Zał.1_WPF_bazowy!#REF!","v":{"$error":"#REF!"}},{"$f":"+Zał.1_WPF_bazowy!#REF!","v":{"$error":"#REF!"}},{"$f":"+Zał.1_WPF_bazowy!#REF!","v":{"$error":"#REF!"}},{"$f":"+Zał.1_WPF_bazowy!#REF!","v":{"$error":"#REF!"}},{"$f":"+Zał.1_WPF_bazowy!#REF!","v":{"$error":"#REF!"}},{"$f":"+Zał.1_WPF_bazowy!#REF!","v":{"$error":"#REF!"}},{"$f":"+Zał.1_WPF_bazowy!#REF!","v":{"$error":"#REF!"}},{"$f":"+Zał.1_WPF_bazowy!#REF!","v":{"$error":"#REF!"}},{"$f":"+Zał.1_WPF_bazowy!#REF!","v":{"$error":"#REF!"}},{"$f":"+Zał.1_WPF_bazowy!#REF!","v":{"$error":"#REF!"}},{"$f":"+Zał.1_WPF_bazowy!#REF!","v":{"$error":"#REF!"}},{"$f":"+Zał.1_WPF_bazowy!#REF!","v":{"$error":"#REF!"}},{"$f":"+Zał.1_WPF_bazowy!#REF!","v":{"$error":"#REF!"}},{"$f":"+Zał.1_WPF_bazowy!#REF!","v":{"$error":"#REF!"}}]
[null,"11.3.2",null,"majątkowe",{"$f":"Zał.1_WPF_bazowy!E70","v":562105.4},{"$f":"Zał.1_WPF_bazowy!F70","v":3180695.36},{"$f":"Zał.1_WPF_bazowy!G70","v":125337.07},{"$f":"Zał.1_WPF_bazowy!H70","v":125337.07},{"$f":"+Zał.1_WPF_bazowy!I70","v":945000},{"$f":"+Zał.1_WPF_bazowy!J70","v":1405000},{"$f":"+Zał.1_WPF_bazowy!K70","v":0},{"$f":"+Zał.1_WPF_bazowy!L70","v":0},{"$f":"+Zał.1_WPF_bazowy!#REF!","v":{"$error":"#REF!"}},{"$f":"+Zał.1_WPF_bazowy!#REF!","v":{"$error":"#REF!"}},{"$f":"+Zał.1_WPF_bazowy!#REF!","v":{"$error":"#REF!"}},{"$f":"+Zał.1_WPF_bazowy!#REF!","v":{"$error":"#REF!"}},{"$f":"+Zał.1_WPF_bazowy!#REF!","v":{"$error":"#REF!"}},{"$f":"+Zał.1_WPF_bazowy!#REF!","v":{"$error":"#REF!"}},{"$f":"+Zał.1_WPF_bazowy!#REF!","v":{"$error":"#REF!"}},{"$f":"+Zał.1_WPF_bazowy!#REF!","v":{"$error":"#REF!"}},{"$f":"+Zał.1_WPF_bazowy!#REF!","v":{"$error":"#REF!"}},{"$f":"+Zał.1_WPF_bazowy!#REF!","v":{"$error":"#REF!"}},{"$f":"+Zał.1_WPF_bazowy!#REF!","v":{"$error":"#REF!"}},{"$f":"+Zał.1_WPF_bazowy!#REF!","v":{"$error":"#REF!"}},{"$f":"+Zał.1_WPF_bazowy!#REF!","v":{"$error":"#REF!"}},{"$f":"+Zał.1_WPF_bazowy!#REF!","v":{"$error":"#REF!"}},{"$f":"+Zał.1_WPF_bazowy!#REF!","v":{"$error":"#REF!"}},{"$f":"+Zał.1_WPF_bazowy!#REF!","v":{"$error":"#REF!"}},{"$f":"+Zał.1_WPF_bazowy!#REF!","v":{"$error":"#REF!"}},{"$f":"+Zał.1_WPF_bazowy!#REF!","v":{"$error":"#REF!"}},{"$f":"+Zał.1_WPF_bazowy!#REF!","v":{"$error":"#REF!"}},{"$f":"+Zał.1_WPF_bazowy!#REF!","v":{"$error":"#REF!"}},{"$f":"+Zał.1_WPF_bazowy!#REF!","v":{"$error":"#REF!"}},{"$f":"+Zał.1_WPF_bazowy!#REF!","v":{"$error":"#REF!"}},{"$f":"+Zał.1_WPF_bazowy!#REF!","v":{"$error":"#REF!"}},{"$f":"+Zał.1_WPF_bazowy!#REF!","v":{"$error":"#REF!"}},{"$f":"+Zał.1_WPF_bazowy!#REF!","v":{"$error":"#REF!"}},{"$f":"+Zał.1_WPF_bazowy!#REF!","v":{"$error":"#REF!"}}]
[null,"11.4",null,"Wydatki inwestycyjne kontynuowane ",{"$f":"Zał.1_WPF_bazowy!E71","v":835040.96},{"$f":"Zał.1_WPF_bazowy!F71","v":3180695.36},{"$f":"Zał.1_WPF_bazowy!G71","v":0},{"$f":"Zał.1_WPF_bazowy!H71","v":0},{"$f":"+Zał.1_WPF_bazowy!I71","v":850000},{"$f":"+Zał.1_WPF_bazowy!J71","v":1405000},{"$f":"+Zał.1_WPF_bazowy!K71","v":0},{"$f":"+Zał.1_WPF_bazowy!L71","v":0},{"$f":"+Zał.1_WPF_bazowy!#REF!","v":{"$error":"#REF!"}},{"$f":"+Zał.1_WPF_bazowy!#REF!","v":{"$error":"#REF!"}},{"$f":"+Zał.1_WPF_bazowy!#REF!","v":{"$error":"#REF!"}},{"$f":"+Zał.1_WPF_bazowy!#REF!","v":{"$error":"#REF!"}},{"$f":"+Zał.1_WPF_bazowy!#REF!","v":{"$error":"#REF!"}},{"$f":"+Zał.1_WPF_bazowy!#REF!","v":{"$error":"#REF!"}},{"$f":"+Zał.1_WPF_bazowy!#REF!","v":{"$error":"#REF!"}},{"$f":"+Zał.1_WPF_bazowy!#REF!","v":{"$error":"#REF!"}},{"$f":"+Zał.1_WPF_bazowy!#REF!","v":{"$error":"#REF!"}},{"$f":"+Zał.1_WPF_bazowy!#REF!","v":{"$error":"#REF!"}},{"$f":"+Zał.1_WPF_bazowy!#REF!","v":{"$error":"#REF!"}},{"$f":"+Zał.1_WPF_bazowy!#REF!","v":{"$error":"#REF!"}},{"$f":"+Zał.1_WPF_bazowy!#REF!","v":{"$error":"#REF!"}},{"$f":"+Zał.1_WPF_bazowy!#REF!","v":{"$error":"#REF!"}},{"$f":"+Zał.1_WPF_bazowy!#REF!","v":{"$error":"#REF!"}},{"$f":"+Zał.1_WPF_bazowy!#REF!","v":{"$error":"#REF!"}},{"$f":"+Zał.1_WPF_bazowy!#REF!","v":{"$error":"#REF!"}},{"$f":"+Zał.1_WPF_bazowy!#REF!","v":{"$error":"#REF!"}},{"$f":"+Zał.1_WPF_bazowy!#REF!","v":{"$error":"#REF!"}},{"$f":"+Zał.1_WPF_bazowy!#REF!","v":{"$error":"#REF!"}},{"$f":"+Zał.1_WPF_bazowy!#REF!","v":{"$error":"#REF!"}},{"$f":"+Zał.1_WPF_bazowy!#REF!","v":{"$error":"#REF!"}},{"$f":"+Zał.1_WPF_bazowy!#REF!","v":{"$error":"#REF!"}},{"$f":"+Zał.1_WPF_bazowy!#REF!","v":{"$error":"#REF!"}},{"$f":"+Zał.1_WPF_bazowy!#REF!","v":{"$error":"#REF!"}},{"$f":"+Zał.1_WPF_bazowy!#REF!","v":{"$error":"#REF!"}}]
[null,"11.5",null,"Nowe wydatki inwestycyjne",{"$f":"Zał.1_WPF_bazowy!E72","v":1590835.04},{"$f":"Zał.1_WPF_bazowy!F72","v":1184793.3400000001},{"$f":"Zał.1_WPF_bazowy!G72","v":4779247.07},{"$f":"Zał.1_WPF_bazowy!H72","v":4782647.07},{"$f":"+Zał.1_WPF_bazowy!I72","v":2899615},{"$f":"+Zał.1_WPF_bazowy!J72","v":1354990},{"$f":"+Zał.1_WPF_bazowy!K72","v":2725882},{"$f":"+Zał.1_WPF_bazowy!L72","v":3349090},{"$f":"+Zał.1_WPF_bazowy!#REF!","v":{"$error":"#REF!"}},{"$f":"+Zał.1_WPF_bazowy!#REF!","v":{"$error":"#REF!"}},{"$f":"+Zał.1_WPF_bazowy!#REF!","v":{"$error":"#REF!"}},{"$f":"+Zał.1_WPF_bazowy!#REF!","v":{"$error":"#REF!"}},{"$f":"+Zał.1_WPF_bazowy!#REF!","v":{"$error":"#REF!"}},{"$f":"+Zał.1_WPF_bazowy!#REF!","v":{"$error":"#REF!"}},{"$f":"+Zał.1_WPF_bazowy!#REF!","v":{"$error":"#REF!"}},{"$f":"+Zał.1_WPF_bazowy!#REF!","v":{"$error":"#REF!"}},{"$f":"+Zał.1_WPF_bazowy!#REF!","v":{"$error":"#REF!"}},{"$f":"+Zał.1_WPF_bazowy!#REF!","v":{"$error":"#REF!"}},{"$f":"+Zał.1_WPF_bazowy!#REF!","v":{"$error":"#REF!"}},{"$f":"+Zał.1_WPF_bazowy!#REF!","v":{"$error":"#REF!"}},{"$f":"+Zał.1_WPF_bazowy!#REF!","v":{"$error":"#REF!"}},{"$f":"+Zał.1_WPF_bazowy!#REF!","v":{"$error":"#REF!"}},{"$f":"+Zał.1_WPF_bazowy!#REF!","v":{"$error":"#REF!"}},{"$f":"+Zał.1_WPF_bazowy!#REF!","v":{"$error":"#REF!"}},{"$f":"+Zał.1_WPF_bazowy!#REF!","v":{"$error":"#REF!"}},{"$f":"+Zał.1_WPF_bazowy!#REF!","v":{"$error":"#REF!"}},{"$f":"+Zał.1_WPF_bazowy!#REF!","v":{"$error":"#REF!"}},{"$f":"+Zał.1_WPF_bazowy!#REF!","v":{"$error":"#REF!"}},{"$f":"+Zał.1_WPF_bazowy!#REF!","v":{"$error":"#REF!"}},{"$f":"+Zał.1_WPF_bazowy!#REF!","v":{"$error":"#REF!"}},{"$f":"+Zał.1_WPF_bazowy!#REF!","v":{"$error":"#REF!"}},{"$f":"+Zał.1_WPF_bazowy!#REF!","v":{"$error":"#REF!"}},{"$f":"+Zał.1_WPF_bazowy!#REF!","v":{"$error":"#REF!"}},{"$f":"+Zał.1_WPF_bazowy!#REF!","v":{"$error":"#REF!"}}]
[null,"11.6",null,"Wydatki majątkowe w formie dotacji ",{"$f":"Zał.1_WPF_bazowy!E73","v":0},{"$f":"Zał.1_WPF_bazowy!F73","v":27700},{"$f":"Zał.1_WPF_bazowy!G73","v":205000},{"$f":"Zał.1_WPF_bazowy!H73","v":205000},{"$f":"+Zał.1_WPF_bazowy!I73","v":0},{"$f":"+Zał.1_WPF_bazowy!J73","v":0},{"$f":"+Zał.1_WPF_bazowy!K73","v":0},{"$f":"+Zał.1_WPF_bazowy!L73","v":0},{"$f":"+Zał.1_WPF_bazowy!#REF!","v":{"$error":"#REF!"}},{"$f":"+Zał.1_WPF_bazowy!#REF!","v":{"$error":"#REF!"}},{"$f":"+Zał.1_WPF_bazowy!#REF!","v":{"$error":"#REF!"}},{"$f":"+Zał.1_WPF_bazowy!#REF!","v":{"$error":"#REF!"}},{"$f":"+Zał.1_WPF_bazowy!#REF!","v":{"$error":"#REF!"}},{"$f":"+Zał.1_WPF_bazowy!#REF!","v":{"$error":"#REF!"}},{"$f":"+Zał.1_WPF_bazowy!#REF!","v":{"$error":"#REF!"}},{"$f":"+Zał.1_WPF_bazowy!#REF!","v":{"$error":"#REF!"}},{"$f":"+Zał.1_WPF_bazowy!#REF!","v":{"$error":"#REF!"}},{"$f":"+Zał.1_WPF_bazowy!#REF!","v":{"$error":"#REF!"}},{"$f":"+Zał.1_WPF_bazowy!#REF!","v":{"$error":"#REF!"}},{"$f":"+Zał.1_WPF_bazowy!#REF!","v":{"$error":"#REF!"}},{"$f":"+Zał.1_WPF_bazowy!#REF!","v":{"$error":"#REF!"}},{"$f":"+Zał.1_WPF_bazowy!#REF!","v":{"$error":"#REF!"}},{"$f":"+Zał.1_WPF_bazowy!#REF!","v":{"$error":"#REF!"}},{"$f":"+Zał.1_WPF_bazowy!#REF!","v":{"$error":"#REF!"}},{"$f":"+Zał.1_WPF_bazowy!#REF!","v":{"$error":"#REF!"}},{"$f":"+Zał.1_WPF_bazowy!#REF!","v":{"$error":"#REF!"}},{"$f":"+Zał.1_WPF_bazowy!#REF!","v":{"$error":"#REF!"}},{"$f":"+Zał.1_WPF_bazowy!#REF!","v":{"$error":"#REF!"}},{"$f":"+Zał.1_WPF_bazowy!#REF!","v":{"$error":"#REF!"}},{"$f":"+Zał.1_WPF_bazowy!#REF!","v":{"$error":"#REF!"}},{"$f":"+Zał.1_WPF_bazowy!#REF!","v":{"$error":"#REF!"}},{"$f":"+Zał.1_WPF_bazowy!#REF!","v":{"$error":"#REF!"}},{"$f":"+Zał.1_WPF_bazowy!#REF!","v":{"$error":"#REF!"}},{"$f":"+Zał.1_WPF_bazowy!#REF!","v":{"$error":"#REF!"}}]
[null,12,null,"Finansowanie programów, projektów lub zadań realizowanych z udziałem środków, o których mowa w art. 5 ust. 1 pkt 2 i 3 ustawy","x","x","x","x","x","x","x","x","x","x","x","x","x","x","x","x","x","x","x","x","x","x","x","x","x","x","x","x","x","x","x","x","x","x"]
[null,"12.1",null,"Dochody bieżące  na programy, projekty lub zadania finansowane z udziałem środków, o których mowa w art. 5 ust. 1 pkt 2 i 3 ustawy",{"$f":"Zał.1_WPF_bazowy!E75","v":179911.06},{"$f":"Zał.1_WPF_bazowy!F75","v":105623.85},{"$f":"Zał.1_WPF_bazowy!G75","v":220846.25},{"$f":"Zał.1_WPF_bazowy!H75","v":220846.25},{"$f":"+Zał.1_WPF_bazowy!I75","v":0},{"$f":"+Zał.1_WPF_bazowy!J75","v":0},{"$f":"+Zał.1_WPF_bazowy!K75","v":0},{"$f":"+Zał.1_WPF_bazowy!L75","v":0},{"$f":"+Zał.1_WPF_bazowy!#REF!","v":{"$error":"#REF!"}},{"$f":"+Zał.1_WPF_bazowy!#REF!","v":{"$error":"#REF!"}},{"$f":"+Zał.1_WPF_bazowy!#REF!","v":{"$error":"#REF!"}},{"$f":"+Zał.1_WPF_bazowy!#REF!","v":{"$error":"#REF!"}},{"$f":"+Zał.1_WPF_bazowy!#REF!","v":{"$error":"#REF!"}},{"$f":"+Zał.1_WPF_bazowy!#REF!","v":{"$error":"#REF!"}},{"$f":"+Zał.1_WPF_bazowy!#REF!","v":{"$error":"#REF!"}},{"$f":"+Zał.1_WPF_bazowy!#REF!","v":{"$error":"#REF!"}},{"$f":"+Zał.1_WPF_bazowy!#REF!","v":{"$error":"#REF!"}},{"$f":"+Zał.1_WPF_bazowy!#REF!","v":{"$error":"#REF!"}},{"$f":"+Zał.1_WPF_bazowy!#REF!","v":{"$error":"#REF!"}},{"$f":"+Zał.1_WPF_bazowy!#REF!","v":{"$error":"#REF!"}},{"$f":"+Zał.1_WPF_bazowy!#REF!","v":{"$error":"#REF!"}},{"$f":"+Zał.1_WPF_bazowy!#REF!","v":{"$error":"#REF!"}},{"$f":"+Zał.1_WPF_bazowy!#REF!","v":{"$error":"#REF!"}},{"$f":"+Zał.1_WPF_bazowy!#REF!","v":{"$error":"#REF!"}},{"$f":"+Zał.1_WPF_bazowy!#REF!","v":{"$error":"#REF!"}},{"$f":"+Zał.1_WPF_bazowy!#REF!","v":{"$error":"#REF!"}},{"$f":"+Zał.1_WPF_bazowy!#REF!","v":{"$error":"#REF!"}},{"$f":"+Zał.1_WPF_bazowy!#REF!","v":{"$error":"#REF!"}},{"$f":"+Zał.1_WPF_bazowy!#REF!","v":{"$error":"#REF!"}},{"$f":"+Zał.1_WPF_bazowy!#REF!","v":{"$error":"#REF!"}},{"$f":"+Zał.1_WPF_bazowy!#REF!","v":{"$error":"#REF!"}},{"$f":"+Zał.1_WPF_bazowy!#REF!","v":{"$error":"#REF!"}},{"$f":"+Zał.1_WPF_bazowy!#REF!","v":{"$error":"#REF!"}},{"$f":"+Zał.1_WPF_bazowy!#REF!","v":{"$error":"#REF!"}}]
[null,"12.1.1",null,"-  w tym środki określone w art. 5 ust. 1 pkt 2 ustawy",{"$f":"Zał.1_WPF_bazowy!E76","v":160689},{"$f":"Zał.1_WPF_bazowy!F76","v":93191.67},{"$f":"Zał.1_WPF_bazowy!G76","v":193149.17},{"$f":"Zał.1_WPF_bazowy!H76","v":193149.17},{"$f":"+Zał.1_WPF_bazowy!I76","v":0},{"$f":"+Zał.1_WPF_bazowy!J76","v":0},{"$f":"+Zał.1_WPF_bazowy!K76","v":0},{"$f":"+Zał.1_WPF_bazowy!L76","v":0},{"$f":"+Zał.1_WPF_bazowy!#REF!","v":{"$error":"#REF!"}},{"$f":"+Zał.1_WPF_bazowy!#REF!","v":{"$error":"#REF!"}},{"$f":"+Zał.1_WPF_bazowy!#REF!","v":{"$error":"#REF!"}},{"$f":"+Zał.1_WPF_bazowy!#REF!","v":{"$error":"#REF!"}},{"$f":"+Zał.1_WPF_bazowy!#REF!","v":{"$error":"#REF!"}},{"$f":"+Zał.1_WPF_bazowy!#REF!","v":{"$error":"#REF!"}},{"$f":"+Zał.1_WPF_bazowy!#REF!","v":{"$error":"#REF!"}},{"$f":"+Zał.1_WPF_bazowy!#REF!","v":{"$error":"#REF!"}},{"$f":"+Zał.1_WPF_bazowy!#REF!","v":{"$error":"#REF!"}},{"$f":"+Zał.1_WPF_bazowy!#REF!","v":{"$error":"#REF!"}},{"$f":"+Zał.1_WPF_bazowy!#REF!","v":{"$error":"#REF!"}},{"$f":"+Zał.1_WPF_bazowy!#REF!","v":{"$error":"#REF!"}},{"$f":"+Zał.1_WPF_bazowy!#REF!","v":{"$error":"#REF!"}},{"$f":"+Zał.1_WPF_bazowy!#REF!","v":{"$error":"#REF!"}},{"$f":"+Zał.1_WPF_bazowy!#REF!","v":{"$error":"#REF!"}},{"$f":"+Zał.1_WPF_bazowy!#REF!","v":{"$error":"#REF!"}},{"$f":"+Zał.1_WPF_bazowy!#REF!","v":{"$error":"#REF!"}},{"$f":"+Zał.1_WPF_bazowy!#REF!","v":{"$error":"#REF!"}},{"$f":"+Zał.1_WPF_bazowy!#REF!","v":{"$error":"#REF!"}},{"$f":"+Zał.1_WPF_bazowy!#REF!","v":{"$error":"#REF!"}},{"$f":"+Zał.1_WPF_bazowy!#REF!","v":{"$error":"#REF!"}},{"$f":"+Zał.1_WPF_bazowy!#REF!","v":{"$error":"#REF!"}},{"$f":"+Zał.1_WPF_bazowy!#REF!","v":{"$error":"#REF!"}},{"$f":"+Zał.1_WPF_bazowy!#REF!","v":{"$error":"#REF!"}},{"$f":"+Zał.1_WPF_bazowy!#REF!","v":{"$error":"#REF!"}},{"$f":"+Zał.1_WPF_bazowy!#REF!","v":{"$error":"#REF!"}}]
[null,"12.1.1.1",null,"- w tym środki określone w art. 5 ust. 1 pkt 2 ustawy wynikające wyłącznie z  zawartych umów na realizację programu, projektu lub zadania",{"$f":"Zał.1_WPF_bazowy!E77","v":0},{"$f":"Zał.1_WPF_bazowy!F77","v":93191.67},{"$f":"Zał.1_WPF_bazowy!G77","v":193149.17},{"$f":"Zał.1_WPF_bazowy!H77","v":193149.17},{"$f":"+Zał.1_WPF_bazowy!I77","v":0},{"$f":"+Zał.1_WPF_bazowy!J77","v":0},{"$f":"+Zał.1_WPF_bazowy!K77","v":0},{"$f":"+Zał.1_WPF_bazowy!L77","v":0},{"$f":"+Zał.1_WPF_bazowy!#REF!","v":{"$error":"#REF!"}},{"$f":"+Zał.1_WPF_bazowy!#REF!","v":{"$error":"#REF!"}},{"$f":"+Zał.1_WPF_bazowy!#REF!","v":{"$error":"#REF!"}},{"$f":"+Zał.1_WPF_bazowy!#REF!","v":{"$error":"#REF!"}},{"$f":"+Zał.1_WPF_bazowy!#REF!","v":{"$error":"#REF!"}},{"$f":"+Zał.1_WPF_bazowy!#REF!","v":{"$error":"#REF!"}},{"$f":"+Zał.1_WPF_bazowy!#REF!","v":{"$error":"#REF!"}},{"$f":"+Zał.1_WPF_bazowy!#REF!","v":{"$error":"#REF!"}},{"$f":"+Zał.1_WPF_bazowy!#REF!","v":{"$error":"#REF!"}},{"$f":"+Zał.1_WPF_bazowy!#REF!","v":{"$error":"#REF!"}},{"$f":"+Zał.1_WPF_bazowy!#REF!","v":{"$error":"#REF!"}},{"$f":"+Zał.1_WPF_bazowy!#REF!","v":{"$error":"#REF!"}},{"$f":"+Zał.1_WPF_bazowy!#REF!","v":{"$error":"#REF!"}},{"$f":"+Zał.1_WPF_bazowy!#REF!","v":{"$error":"#REF!"}},{"$f":"+Zał.1_WPF_bazowy!#REF!","v":{"$error":"#REF!"}},{"$f":"+Zał.1_WPF_bazowy!#REF!","v":{"$error":"#REF!"}},{"$f":"+Zał.1_WPF_bazowy!#REF!","v":{"$error":"#REF!"}},{"$f":"+Zał.1_WPF_bazowy!#REF!","v":{"$error":"#REF!"}},{"$f":"+Zał.1_WPF_bazowy!#REF!","v":{"$error":"#REF!"}},{"$f":"+Zał.1_WPF_bazowy!#REF!","v":{"$error":"#REF!"}},{"$f":"+Zał.1_WPF_bazowy!#REF!","v":{"$error":"#REF!"}},{"$f":"+Zał.1_WPF_bazowy!#REF!","v":{"$error":"#REF!"}},{"$f":"+Zał.1_WPF_bazowy!#REF!","v":{"$error":"#REF!"}},{"$f":"+Zał.1_WPF_bazowy!#REF!","v":{"$error":"#REF!"}},{"$f":"+Zał.1_WPF_bazowy!#REF!","v":{"$error":"#REF!"}},{"$f":"+Zał.1_WPF_bazowy!#REF!","v":{"$error":"#REF!"}}]
[null,"12.2",null,"Dochody majątkowe  na programy, projekty lub zadania finansowane z udziałem środków, o których mowa w art. 5 ust. 1 pkt 2 i 3 ustawy",{"$f":"Zał.1_WPF_bazowy!E78","v":1013324.7},{"$f":"Zał.1_WPF_bazowy!F78","v":478204.67},{"$f":"Zał.1_WPF_bazowy!G78","v":2251441.0699999998},{"$f":"Zał.1_WPF_bazowy!H78","v":2251441.0699999998},{"$f":"+Zał.1_WPF_bazowy!I78","v":7900},{"$f":"+Zał.1_WPF_bazowy!J78","v":0},{"$f":"+Zał.1_WPF_bazowy!K78","v":0},{"$f":"+Zał.1_WPF_bazowy!L78","v":0},{"$f":"+Zał.1_WPF_bazowy!#REF!","v":{"$error":"#REF!"}},{"$f":"+Zał.1_WPF_bazowy!#REF!","v":{"$error":"#REF!"}},{"$f":"+Zał.1_WPF_bazowy!#REF!","v":{"$error":"#REF!"}},{"$f":"+Zał.1_WPF_bazowy!#REF!","v":{"$error":"#REF!"}},{"$f":"+Zał.1_WPF_bazowy!#REF!","v":{"$error":"#REF!"}},{"$f":"+Zał.1_WPF_bazowy!#REF!","v":{"$error":"#REF!"}},{"$f":"+Zał.1_WPF_bazowy!#REF!","v":{"$error":"#REF!"}},{"$f":"+Zał.1_WPF_bazowy!#REF!","v":{"$error":"#REF!"}},{"$f":"+Zał.1_WPF_bazowy!#REF!","v":{"$error":"#REF!"}},{"$f":"+Zał.1_WPF_bazowy!#REF!","v":{"$error":"#REF!"}},{"$f":"+Zał.1_WPF_bazowy!#REF!","v":{"$error":"#REF!"}},{"$f":"+Zał.1_WPF_bazowy!#REF!","v":{"$error":"#REF!"}},{"$f":"+Zał.1_WPF_bazowy!#REF!","v":{"$error":"#REF!"}},{"$f":"+Zał.1_WPF_bazowy!#REF!","v":{"$error":"#REF!"}},{"$f":"+Zał.1_WPF_bazowy!#REF!","v":{"$error":"#REF!"}},{"$f":"+Zał.1_WPF_bazowy!#REF!","v":{"$error":"#REF!"}},{"$f":"+Zał.1_WPF_bazowy!#REF!","v":{"$error":"#REF!"}},{"$f":"+Zał.1_WPF_bazowy!#REF!","v":{"$error":"#REF!"}},{"$f":"+Zał.1_WPF_bazowy!#REF!","v":{"$error":"#REF!"}},{"$f":"+Zał.1_WPF_bazowy!#REF!","v":{"$error":"#REF!"}},{"$f":"+Zał.1_WPF_bazowy!#REF!","v":{"$error":"#REF!"}},{"$f":"+Zał.1_WPF_bazowy!#REF!","v":{"$error":"#REF!"}},{"$f":"+Zał.1_WPF_bazowy!#REF!","v":{"$error":"#REF!"}},{"$f":"+Zał.1_WPF_bazowy!#REF!","v":{"$error":"#REF!"}},{"$f":"+Zał.1_WPF_bazowy!#REF!","v":{"$error":"#REF!"}},{"$f":"+Zał.1_WPF_bazowy!#REF!","v":{"$error":"#REF!"}}]
[null,"12.2.1",null,"-  w tym środki określone w art. 5 ust. 1 pkt 2 ustawy",{"$f":"Zał.1_WPF_bazowy!E79","v":826032},{"$f":"Zał.1_WPF_bazowy!F79","v":232601.81},{"$f":"Zał.1_WPF_bazowy!G79","v":2195185.5099999998},{"$f":"Zał.1_WPF_bazowy!H79","v":2195185.5099999998},{"$f":"+Zał.1_WPF_bazowy!I79","v":0},{"$f":"+Zał.1_WPF_bazowy!J79","v":0},{"$f":"+Zał.1_WPF_bazowy!K79","v":0},{"$f":"+Zał.1_WPF_bazowy!L79","v":0},{"$f":"+Zał.1_WPF_bazowy!#REF!","v":{"$error":"#REF!"}},{"$f":"+Zał.1_WPF_bazowy!#REF!","v":{"$error":"#REF!"}},{"$f":"+Zał.1_WPF_bazowy!#REF!","v":{"$error":"#REF!"}},{"$f":"+Zał.1_WPF_bazowy!#REF!","v":{"$error":"#REF!"}},{"$f":"+Zał.1_WPF_bazowy!#REF!","v":{"$error":"#REF!"}},{"$f":"+Zał.1_WPF_bazowy!#REF!","v":{"$error":"#REF!"}},{"$f":"+Zał.1_WPF_bazowy!#REF!","v":{"$error":"#REF!"}},{"$f":"+Zał.1_WPF_bazowy!#REF!","v":{"$error":"#REF!"}},{"$f":"+Zał.1_WPF_bazowy!#REF!","v":{"$error":"#REF!"}},{"$f":"+Zał.1_WPF_bazowy!#REF!","v":{"$error":"#REF!"}},{"$f":"+Zał.1_WPF_bazowy!#REF!","v":{"$error":"#REF!"}},{"$f":"+Zał.1_WPF_bazowy!#REF!","v":{"$error":"#REF!"}},{"$f":"+Zał.1_WPF_bazowy!#REF!","v":{"$error":"#REF!"}},{"$f":"+Zał.1_WPF_bazowy!#REF!","v":{"$error":"#REF!"}},{"$f":"+Zał.1_WPF_bazowy!#REF!","v":{"$error":"#REF!"}},{"$f":"+Zał.1_WPF_bazowy!#REF!","v":{"$error":"#REF!"}},{"$f":"+Zał.1_WPF_bazowy!#REF!","v":{"$error":"#REF!"}},{"$f":"+Zał.1_WPF_bazowy!#REF!","v":{"$error":"#REF!"}},{"$f":"+Zał.1_WPF_bazowy!#REF!","v":{"$error":"#REF!"}},{"$f":"+Zał.1_WPF_bazowy!#REF!","v":{"$error":"#REF!"}},{"$f":"+Zał.1_WPF_bazowy!#REF!","v":{"$error":"#REF!"}},{"$f":"+Zał.1_WPF_bazowy!#REF!","v":{"$error":"#REF!"}},{"$f":"+Zał.1_WPF_bazowy!#REF!","v":{"$error":"#REF!"}},{"$f":"+Zał.1_WPF_bazowy!#REF!","v":{"$error":"#REF!"}},{"$f":"+Zał.1_WPF_bazowy!#REF!","v":{"$error":"#REF!"}},{"$f":"+Zał.1_WPF_bazowy!#REF!","v":{"$error":"#REF!"}}]
[null,"12.2.1.1",null,"- w tym środki określone w art. 5 ust. 1 pkt 2 ustawy wynikające wyłącznie z zawartych umów na realizację programu, projektu lub zadania",{"$f":"Zał.1_WPF_bazowy!E80","v":0},{"$f":"Zał.1_WPF_bazowy!F80","v":232601.81},{"$f":"Zał.1_WPF_bazowy!G80","v":2195185.5099999998},{"$f":"Zał.1_WPF_bazowy!H80","v":2195185.5099999998},{"$f":"+Zał.1_WPF_bazowy!I80","v":0},{"$f":"+Zał.1_WPF_bazowy!J80","v":0},{"$f":"+Zał.1_WPF_bazowy!K80","v":0},{"$f":"+Zał.1_WPF_bazowy!L80","v":0},{"$f":"+Zał.1_WPF_bazowy!#REF!","v":{"$error":"#REF!"}},{"$f":"+Zał.1_WPF_bazowy!#REF!","v":{"$error":"#REF!"}},{"$f":"+Zał.1_WPF_bazowy!#REF!","v":{"$error":"#REF!"}},{"$f":"+Zał.1_WPF_bazowy!#REF!","v":{"$error":"#REF!"}},{"$f":"+Zał.1_WPF_bazowy!#REF!","v":{"$error":"#REF!"}},{"$f":"+Zał.1_WPF_bazowy!#REF!","v":{"$error":"#REF!"}},{"$f":"+Zał.1_WPF_bazowy!#REF!","v":{"$error":"#REF!"}},{"$f":"+Zał.1_WPF_bazowy!#REF!","v":{"$error":"#REF!"}},{"$f":"+Zał.1_WPF_bazowy!#REF!","v":{"$error":"#REF!"}},{"$f":"+Zał.1_WPF_bazowy!#REF!","v":{"$error":"#REF!"}},{"$f":"+Zał.1_WPF_bazowy!#REF!","v":{"$error":"#REF!"}},{"$f":"+Zał.1_WPF_bazowy!#REF!","v":{"$error":"#REF!"}},{"$f":"+Zał.1_WPF_bazowy!#REF!","v":{"$error":"#REF!"}},{"$f":"+Zał.1_WPF_bazowy!#REF!","v":{"$error":"#REF!"}},{"$f":"+Zał.1_WPF_bazowy!#REF!","v":{"$error":"#REF!"}},{"$f":"+Zał.1_WPF_bazowy!#REF!","v":{"$error":"#REF!"}},{"$f":"+Zał.1_WPF_bazowy!#REF!","v":{"$error":"#REF!"}},{"$f":"+Zał.1_WPF_bazowy!#REF!","v":{"$error":"#REF!"}},{"$f":"+Zał.1_WPF_bazowy!#REF!","v":{"$error":"#REF!"}},{"$f":"+Zał.1_WPF_bazowy!#REF!","v":{"$error":"#REF!"}},{"$f":"+Zał.1_WPF_bazowy!#REF!","v":{"$error":"#REF!"}},{"$f":"+Zał.1_WPF_bazowy!#REF!","v":{"$error":"#REF!"}},{"$f":"+Zał.1_WPF_bazowy!#REF!","v":{"$error":"#REF!"}},{"$f":"+Zał.1_WPF_bazowy!#REF!","v":{"$error":"#REF!"}},{"$f":"+Zał.1_WPF_bazowy!#REF!","v":{"$error":"#REF!"}},{"$f":"+Zał.1_WPF_bazowy!#REF!","v":{"$error":"#REF!"}}]
[null,"12.3",null,"Wydatki bieżące na programy, projekty lub zadania finansowane z udziałem środków, o których mowa w art. 5 ust. 1 pkt 2 i 3 ustawy",{"$f":"Zał.1_WPF_bazowy!E81","v":156869.10999999999},{"$f":"Zał.1_WPF_bazowy!F81","v":138833.24},{"$f":"Zał.1_WPF_bazowy!G81","v":227234.31},{"$f":"Zał.1_WPF_bazowy!H81","v":227234.31},{"$f":"+Zał.1_WPF_bazowy!I81","v":0},{"$f":"+Zał.1_WPF_bazowy!J81","v":0},{"$f":"+Zał.1_WPF_bazowy!K81","v":0},{"$f":"+Zał.1_WPF_bazowy!L81","v":0},{"$f":"+Zał.1_WPF_bazowy!#REF!","v":{"$error":"#REF!"}},{"$f":"+Zał.1_WPF_bazowy!#REF!","v":{"$error":"#REF!"}},{"$f":"+Zał.1_WPF_bazowy!#REF!","v":{"$error":"#REF!"}},{"$f":"+Zał.1_WPF_bazowy!#REF!","v":{"$error":"#REF!"}},{"$f":"+Zał.1_WPF_bazowy!#REF!","v":{"$error":"#REF!"}},{"$f":"+Zał.1_WPF_bazowy!#REF!","v":{"$error":"#REF!"}},{"$f":"+Zał.1_WPF_bazowy!#REF!","v":{"$error":"#REF!"}},{"$f":"+Zał.1_WPF_bazowy!#REF!","v":{"$error":"#REF!"}},{"$f":"+Zał.1_WPF_bazowy!#REF!","v":{"$error":"#REF!"}},{"$f":"+Zał.1_WPF_bazowy!#REF!","v":{"$error":"#REF!"}},{"$f":"+Zał.1_WPF_bazowy!#REF!","v":{"$error":"#REF!"}},{"$f":"+Zał.1_WPF_bazowy!#REF!","v":{"$error":"#REF!"}},{"$f":"+Zał.1_WPF_bazowy!#REF!","v":{"$error":"#REF!"}},{"$f":"+Zał.1_WPF_bazowy!#REF!","v":{"$error":"#REF!"}},{"$f":"+Zał.1_WPF_bazowy!#REF!","v":{"$error":"#REF!"}},{"$f":"+Zał.1_WPF_bazowy!#REF!","v":{"$error":"#REF!"}},{"$f":"+Zał.1_WPF_bazowy!#REF!","v":{"$error":"#REF!"}},{"$f":"+Zał.1_WPF_bazowy!#REF!","v":{"$error":"#REF!"}},{"$f":"+Zał.1_WPF_bazowy!#REF!","v":{"$error":"#REF!"}},{"$f":"+Zał.1_WPF_bazowy!#REF!","v":{"$error":"#REF!"}},{"$f":"+Zał.1_WPF_bazowy!#REF!","v":{"$error":"#REF!"}},{"$f":"+Zał.1_WPF_bazowy!#REF!","v":{"$error":"#REF!"}},{"$f":"+Zał.1_WPF_bazowy!#REF!","v":{"$error":"#REF!"}},{"$f":"+Zał.1_WPF_bazowy!#REF!","v":{"$error":"#REF!"}},{"$f":"+Zał.1_WPF_bazowy!#REF!","v":{"$error":"#REF!"}},{"$f":"+Zał.1_WPF_bazowy!#REF!","v":{"$error":"#REF!"}}]
[null,"12.3.1",null,"-  w tym finansowane środkami określonymi w art. 5 ust. 1 pkt 2 ustawy ",{"$f":"Zał.1_WPF_bazowy!E82","v":133542.57999999999},{"$f":"Zał.1_WPF_bazowy!F82","v":120259.63},{"$f":"Zał.1_WPF_bazowy!G82","v":193149.17},{"$f":"Zał.1_WPF_bazowy!H82","v":193149.17},{"$f":"+Zał.1_WPF_bazowy!I82","v":0},{"$f":"+Zał.1_WPF_bazowy!J82","v":0},{"$f":"+Zał.1_WPF_bazowy!K82","v":0},{"$f":"+Zał.1_WPF_bazowy!L82","v":0},{"$f":"+Zał.1_WPF_bazowy!#REF!","v":{"$error":"#REF!"}},{"$f":"+Zał.1_WPF_bazowy!#REF!","v":{"$error":"#REF!"}},{"$f":"+Zał.1_WPF_bazowy!#REF!","v":{"$error":"#REF!"}},{"$f":"+Zał.1_WPF_bazowy!#REF!","v":{"$error":"#REF!"}},{"$f":"+Zał.1_WPF_bazowy!#REF!","v":{"$error":"#REF!"}},{"$f":"+Zał.1_WPF_bazowy!#REF!","v":{"$error":"#REF!"}},{"$f":"+Zał.1_WPF_bazowy!#REF!","v":{"$error":"#REF!"}},{"$f":"+Zał.1_WPF_bazowy!#REF!","v":{"$error":"#REF!"}},{"$f":"+Zał.1_WPF_bazowy!#REF!","v":{"$error":"#REF!"}},{"$f":"+Zał.1_WPF_bazowy!#REF!","v":{"$error":"#REF!"}},{"$f":"+Zał.1_WPF_bazowy!#REF!","v":{"$error":"#REF!"}},{"$f":"+Zał.1_WPF_bazowy!#REF!","v":{"$error":"#REF!"}},{"$f":"+Zał.1_WPF_bazowy!#REF!","v":{"$error":"#REF!"}},{"$f":"+Zał.1_WPF_bazowy!#REF!","v":{"$error":"#REF!"}},{"$f":"+Zał.1_WPF_bazowy!#REF!","v":{"$error":"#REF!"}},{"$f":"+Zał.1_WPF_bazowy!#REF!","v":{"$error":"#REF!"}},{"$f":"+Zał.1_WPF_bazowy!#REF!","v":{"$error":"#REF!"}},{"$f":"+Zał.1_WPF_bazowy!#REF!","v":{"$error":"#REF!"}},{"$f":"+Zał.1_WPF_bazowy!#REF!","v":{"$error":"#REF!"}},{"$f":"+Zał.1_WPF_bazowy!#REF!","v":{"$error":"#REF!"}},{"$f":"+Zał.1_WPF_bazowy!#REF!","v":{"$error":"#REF!"}},{"$f":"+Zał.1_WPF_bazowy!#REF!","v":{"$error":"#REF!"}},{"$f":"+Zał.1_WPF_bazowy!#REF!","v":{"$error":"#REF!"}},{"$f":"+Zał.1_WPF_bazowy!#REF!","v":{"$error":"#REF!"}},{"$f":"+Zał.1_WPF_bazowy!#REF!","v":{"$error":"#REF!"}},{"$f":"+Zał.1_WPF_bazowy!#REF!","v":{"$error":"#REF!"}}]
[null,"12.3.2",null,"Wydatki bieżące na realizację programu, projektu lub zadania wynikające wyłącznie z zawartych umów z podmiotem dysponującym środkami, o których mowa w art. 5 ust. 1 pkt 2 ustawy ",{"$f":"Zał.1_WPF_bazowy!E83","v":0},{"$f":"Zał.1_WPF_bazowy!F83","v":138833.24},{"$f":"Zał.1_WPF_bazowy!G83","v":227234.31},{"$f":"Zał.1_WPF_bazowy!H83","v":227234.31},{"$f":"+Zał.1_WPF_bazowy!I83","v":0},{"$f":"+Zał.1_WPF_bazowy!J83","v":0},{"$f":"+Zał.1_WPF_bazowy!K83","v":0},{"$f":"+Zał.1_WPF_bazowy!L83","v":0},{"$f":"+Zał.1_WPF_bazowy!#REF!","v":{"$error":"#REF!"}},{"$f":"+Zał.1_WPF_bazowy!#REF!","v":{"$error":"#REF!"}},{"$f":"+Zał.1_WPF_bazowy!#REF!","v":{"$error":"#REF!"}},{"$f":"+Zał.1_WPF_bazowy!#REF!","v":{"$error":"#REF!"}},{"$f":"+Zał.1_WPF_bazowy!#REF!","v":{"$error":"#REF!"}},{"$f":"+Zał.1_WPF_bazowy!#REF!","v":{"$error":"#REF!"}},{"$f":"+Zał.1_WPF_bazowy!#REF!","v":{"$error":"#REF!"}},{"$f":"+Zał.1_WPF_bazowy!#REF!","v":{"$error":"#REF!"}},{"$f":"+Zał.1_WPF_bazowy!#REF!","v":{"$error":"#REF!"}},{"$f":"+Zał.1_WPF_bazowy!#REF!","v":{"$error":"#REF!"}},{"$f":"+Zał.1_WPF_bazowy!#REF!","v":{"$error":"#REF!"}},{"$f":"+Zał.1_WPF_bazowy!#REF!","v":{"$error":"#REF!"}},{"$f":"+Zał.1_WPF_bazowy!#REF!","v":{"$error":"#REF!"}},{"$f":"+Zał.1_WPF_bazowy!#REF!","v":{"$error":"#REF!"}},{"$f":"+Zał.1_WPF_bazowy!#REF!","v":{"$error":"#REF!"}},{"$f":"+Zał.1_WPF_bazowy!#REF!","v":{"$error":"#REF!"}},{"$f":"+Zał.1_WPF_bazowy!#REF!","v":{"$error":"#REF!"}},{"$f":"+Zał.1_WPF_bazowy!#REF!","v":{"$error":"#REF!"}},{"$f":"+Zał.1_WPF_bazowy!#REF!","v":{"$error":"#REF!"}},{"$f":"+Zał.1_WPF_bazowy!#REF!","v":{"$error":"#REF!"}},{"$f":"+Zał.1_WPF_bazowy!#REF!","v":{"$error":"#REF!"}},{"$f":"+Zał.1_WPF_bazowy!#REF!","v":{"$error":"#REF!"}},{"$f":"+Zał.1_WPF_bazowy!#REF!","v":{"$error":"#REF!"}},{"$f":"+Zał.1_WPF_bazowy!#REF!","v":{"$error":"#REF!"}},{"$f":"+Zał.1_WPF_bazowy!#REF!","v":{"$error":"#REF!"}},{"$f":"+Zał.1_WPF_bazowy!#REF!","v":{"$error":"#REF!"}}]
[null,"12.4",null,"Wydatki majątkowe na programy, projekty lub zadania finansowane z udziałem środków, o których mowa w art. 5 ust. 1 pkt 2 i 3 ustawy",{"$f":"Zał.1_WPF_bazowy!E84","v":562105.4},{"$f":"Zał.1_WPF_bazowy!F84","v":3180695.36},{"$f":"Zał.1_WPF_bazowy!G84","v":95037.07},{"$f":"Zał.1_WPF_bazowy!H84","v":95037.07},{"$f":"+Zał.1_WPF_bazowy!I84","v":0},{"$f":"+Zał.1_WPF_bazowy!J84","v":0},{"$f":"+Zał.1_WPF_bazowy!K84","v":0},{"$f":"+Zał.1_WPF_bazowy!L84","v":0},{"$f":"+Zał.1_WPF_bazowy!#REF!","v":{"$error":"#REF!"}},{"$f":"+Zał.1_WPF_bazowy!#REF!","v":{"$error":"#REF!"}},{"$f":"+Zał.1_WPF_bazowy!#REF!","v":{"$error":"#REF!"}},{"$f":"+Zał.1_WPF_bazowy!#REF!","v":{"$error":"#REF!"}},{"$f":"+Zał.1_WPF_bazowy!#REF!","v":{"$error":"#REF!"}},{"$f":"+Zał.1_WPF_bazowy!#REF!","v":{"$error":"#REF!"}},{"$f":"+Zał.1_WPF_bazowy!#REF!","v":{"$error":"#REF!"}},{"$f":"+Zał.1_WPF_bazowy!#REF!","v":{"$error":"#REF!"}},{"$f":"+Zał.1_WPF_bazowy!#REF!","v":{"$error":"#REF!"}},{"$f":"+Zał.1_WPF_bazowy!#REF!","v":{"$error":"#REF!"}},{"$f":"+Zał.1_WPF_bazowy!#REF!","v":{"$error":"#REF!"}},{"$f":"+Zał.1_WPF_bazowy!#REF!","v":{"$error":"#REF!"}},{"$f":"+Zał.1_WPF_bazowy!#REF!","v":{"$error":"#REF!"}},{"$f":"+Zał.1_WPF_bazowy!#REF!","v":{"$error":"#REF!"}},{"$f":"+Zał.1_WPF_bazowy!#REF!","v":{"$error":"#REF!"}},{"$f":"+Zał.1_WPF_bazowy!#REF!","v":{"$error":"#REF!"}},{"$f":"+Zał.1_WPF_bazowy!#REF!","v":{"$error":"#REF!"}},{"$f":"+Zał.1_WPF_bazowy!#REF!","v":{"$error":"#REF!"}},{"$f":"+Zał.1_WPF_bazowy!#REF!","v":{"$error":"#REF!"}},{"$f":"+Zał.1_WPF_bazowy!#REF!","v":{"$error":"#REF!"}},{"$f":"+Zał.1_WPF_bazowy!#REF!","v":{"$error":"#REF!"}},{"$f":"+Zał.1_WPF_bazowy!#REF!","v":{"$error":"#REF!"}},{"$f":"+Zał.1_WPF_bazowy!#REF!","v":{"$error":"#REF!"}},{"$f":"+Zał.1_WPF_bazowy!#REF!","v":{"$error":"#REF!"}},{"$f":"+Zał.1_WPF_bazowy!#REF!","v":{"$error":"#REF!"}},{"$f":"+Zał.1_WPF_bazowy!#REF!","v":{"$error":"#REF!"}}]
[null,"12.4.1",null,"-  w tym finansowane środkami określonymi w art. 5 ust. 1 pkt 2 ustawy",{"$f":"Zał.1_WPF_bazowy!E85","v":220814.52},{"$f":"Zał.1_WPF_bazowy!F85","v":3180695.36},{"$f":"Zał.1_WPF_bazowy!G85","v":80781.509999999995},{"$f":"Zał.1_WPF_bazowy!H85","v":80781.509999999995},{"$f":"+Zał.1_WPF_bazowy!I85","v":0},{"$f":"+Zał.1_WPF_bazowy!J85","v":0},{"$f":"+Zał.1_WPF_bazowy!K85","v":0},{"$f":"+Zał.1_WPF_bazowy!L85","v":0},{"$f":"+Zał.1_WPF_bazowy!#REF!","v":{"$error":"#REF!"}},{"$f":"+Zał.1_WPF_bazowy!#REF!","v":{"$error":"#REF!"}},{"$f":"+Zał.1_WPF_bazowy!#REF!","v":{"$error":"#REF!"}},{"$f":"+Zał.1_WPF_bazowy!#REF!","v":{"$error":"#REF!"}},{"$f":"+Zał.1_WPF_bazowy!#REF!","v":{"$error":"#REF!"}},{"$f":"+Zał.1_WPF_bazowy!#REF!","v":{"$error":"#REF!"}},{"$f":"+Zał.1_WPF_bazowy!#REF!","v":{"$error":"#REF!"}},{"$f":"+Zał.1_WPF_bazowy!#REF!","v":{"$error":"#REF!"}},{"$f":"+Zał.1_WPF_bazowy!#REF!","v":{"$error":"#REF!"}},{"$f":"+Zał.1_WPF_bazowy!#REF!","v":{"$error":"#REF!"}},{"$f":"+Zał.1_WPF_bazowy!#REF!","v":{"$error":"#REF!"}},{"$f":"+Zał.1_WPF_bazowy!#REF!","v":{"$error":"#REF!"}},{"$f":"+Zał.1_WPF_bazowy!#REF!","v":{"$error":"#REF!"}},{"$f":"+Zał.1_WPF_bazowy!#REF!","v":{"$error":"#REF!"}},{"$f":"+Zał.1_WPF_bazowy!#REF!","v":{"$error":"#REF!"}},{"$f":"+Zał.1_WPF_bazowy!#REF!","v":{"$error":"#REF!"}},{"$f":"+Zał.1_WPF_bazowy!#REF!","v":{"$error":"#REF!"}},{"$f":"+Zał.1_WPF_bazowy!#REF!","v":{"$error":"#REF!"}},{"$f":"+Zał.1_WPF_bazowy!#REF!","v":{"$error":"#REF!"}},{"$f":"+Zał.1_WPF_bazowy!#REF!","v":{"$error":"#REF!"}},{"$f":"+Zał.1_WPF_bazowy!#REF!","v":{"$error":"#REF!"}},{"$f":"+Zał.1_WPF_bazowy!#REF!","v":{"$error":"#REF!"}},{"$f":"+Zał.1_WPF_bazowy!#REF!","v":{"$error":"#REF!"}},{"$f":"+Zał.1_WPF_bazowy!#REF!","v":{"$error":"#REF!"}},{"$f":"+Zał.1_WPF_bazowy!#REF!","v":{"$error":"#REF!"}},{"$f":"+Zał.1_WPF_bazowy!#REF!","v":{"$error":"#REF!"}}]
[null,"12.4.2",null,"Wydatki majątkowe na realizację programu, projektu lub zadania wynikające wyłącznie z zawartych umów z podmiotem dysponującym środkami, o których mowa w art. 5 ust. 1 pkt 2 ustawy ",{"$f":"Zał.1_WPF_bazowy!E86","v":0},{"$f":"Zał.1_WPF_bazowy!F86","v":2074095.36},{"$f":"Zał.1_WPF_bazowy!G86","v":0},{"$f":"Zał.1_WPF_bazowy!H86","v":0},{"$f":"+Zał.1_WPF_bazowy!I86","v":0},{"$f":"+Zał.1_WPF_bazowy!J86","v":0},{"$f":"+Zał.1_WPF_bazowy!K86","v":0},{"$f":"+Zał.1_WPF_bazowy!L86","v":0},{"$f":"+Zał.1_WPF_bazowy!#REF!","v":{"$error":"#REF!"}},{"$f":"+Zał.1_WPF_bazowy!#REF!","v":{"$error":"#REF!"}},{"$f":"+Zał.1_WPF_bazowy!#REF!","v":{"$error":"#REF!"}},{"$f":"+Zał.1_WPF_bazowy!#REF!","v":{"$error":"#REF!"}},{"$f":"+Zał.1_WPF_bazowy!#REF!","v":{"$error":"#REF!"}},{"$f":"+Zał.1_WPF_bazowy!#REF!","v":{"$error":"#REF!"}},{"$f":"+Zał.1_WPF_bazowy!#REF!","v":{"$error":"#REF!"}},{"$f":"+Zał.1_WPF_bazowy!#REF!","v":{"$error":"#REF!"}},{"$f":"+Zał.1_WPF_bazowy!#REF!","v":{"$error":"#REF!"}},{"$f":"+Zał.1_WPF_bazowy!#REF!","v":{"$error":"#REF!"}},{"$f":"+Zał.1_WPF_bazowy!#REF!","v":{"$error":"#REF!"}},{"$f":"+Zał.1_WPF_bazowy!#REF!","v":{"$error":"#REF!"}},{"$f":"+Zał.1_WPF_bazowy!#REF!","v":{"$error":"#REF!"}},{"$f":"+Zał.1_WPF_bazowy!#REF!","v":{"$error":"#REF!"}},{"$f":"+Zał.1_WPF_bazowy!#REF!","v":{"$error":"#REF!"}},{"$f":"+Zał.1_WPF_bazowy!#REF!","v":{"$error":"#REF!"}},{"$f":"+Zał.1_WPF_bazowy!#REF!","v":{"$error":"#REF!"}},{"$f":"+Zał.1_WPF_bazowy!#REF!","v":{"$error":"#REF!"}},{"$f":"+Zał.1_WPF_bazowy!#REF!","v":{"$error":"#REF!"}},{"$f":"+Zał.1_WPF_bazowy!#REF!","v":{"$error":"#REF!"}},{"$f":"+Zał.1_WPF_bazowy!#REF!","v":{"$error":"#REF!"}},{"$f":"+Zał.1_WPF_bazowy!#REF!","v":{"$error":"#REF!"}},{"$f":"+Zał.1_WPF_bazowy!#REF!","v":{"$error":"#REF!"}},{"$f":"+Zał.1_WPF_bazowy!#REF!","v":{"$error":"#REF!"}},{"$f":"+Zał.1_WPF_bazowy!#REF!","v":{"$error":"#REF!"}},{"$f":"+Zał.1_WPF_bazowy!#REF!","v":{"$error":"#REF!"}}]
[null,"12.5",null,"Wydatki na wkład krajowy w związku z umową na realizację programu, projektu lub zadania finansowanego z udziałem środków, o których mowa w art. 5 ust. 1 pkt 2 ustawy bez względu na stopień finansowania tymi środkami ",{"$f":"Zał.1_WPF_bazowy!E87","v":0},{"$f":"Zał.1_WPF_bazowy!F87","v":0},{"$f":"Zał.1_WPF_bazowy!G87","v":0},{"$f":"Zał.1_WPF_bazowy!H87","v":0},{"$f":"+Zał.1_WPF_bazowy!I87","v":0},{"$f":"+Zał.1_WPF_bazowy!J87","v":0},{"$f":"+Zał.1_WPF_bazowy!K87","v":0},{"$f":"+Zał.1_WPF_bazowy!L87","v":0},{"$f":"+Zał.1_WPF_bazowy!#REF!","v":{"$error":"#REF!"}},{"$f":"+Zał.1_WPF_bazowy!#REF!","v":{"$error":"#REF!"}},{"$f":"+Zał.1_WPF_bazowy!#REF!","v":{"$error":"#REF!"}},{"$f":"+Zał.1_WPF_bazowy!#REF!","v":{"$error":"#REF!"}},{"$f":"+Zał.1_WPF_bazowy!#REF!","v":{"$error":"#REF!"}},{"$f":"+Zał.1_WPF_bazowy!#REF!","v":{"$error":"#REF!"}},{"$f":"+Zał.1_WPF_bazowy!#REF!","v":{"$error":"#REF!"}},{"$f":"+Zał.1_WPF_bazowy!#REF!","v":{"$error":"#REF!"}},{"$f":"+Zał.1_WPF_bazowy!#REF!","v":{"$error":"#REF!"}},{"$f":"+Zał.1_WPF_bazowy!#REF!","v":{"$error":"#REF!"}},{"$f":"+Zał.1_WPF_bazowy!#REF!","v":{"$error":"#REF!"}},{"$f":"+Zał.1_WPF_bazowy!#REF!","v":{"$error":"#REF!"}},{"$f":"+Zał.1_WPF_bazowy!#REF!","v":{"$error":"#REF!"}},{"$f":"+Zał.1_WPF_bazowy!#REF!","v":{"$error":"#REF!"}},{"$f":"+Zał.1_WPF_bazowy!#REF!","v":{"$error":"#REF!"}},{"$f":"+Zał.1_WPF_bazowy!#REF!","v":{"$error":"#REF!"}},{"$f":"+Zał.1_WPF_bazowy!#REF!","v":{"$error":"#REF!"}},{"$f":"+Zał.1_WPF_bazowy!#REF!","v":{"$error":"#REF!"}},{"$f":"+Zał.1_WPF_bazowy!#REF!","v":{"$error":"#REF!"}},{"$f":"+Zał.1_WPF_bazowy!#REF!","v":{"$error":"#REF!"}},{"$f":"+Zał.1_WPF_bazowy!#REF!","v":{"$error":"#REF!"}},{"$f":"+Zał.1_WPF_bazowy!#REF!","v":{"$error":"#REF!"}},{"$f":"+Zał.1_WPF_bazowy!#REF!","v":{"$error":"#REF!"}},{"$f":"+Zał.1_WPF_bazowy!#REF!","v":{"$error":"#REF!"}},{"$f":"+Zał.1_WPF_bazowy!#REF!","v":{"$error":"#REF!"}},{"$f":"+Zał.1_WPF_bazowy!#REF!","v":{"$error":"#REF!"}}]
[null,"12.5.1",null,"w tym w związku z już zawartą umową na realizację programu, projektu lub zadania",{"$f":"Zał.1_WPF_bazowy!E88","v":0},{"$f":"Zał.1_WPF_bazowy!F88","v":0},{"$f":"Zał.1_WPF_bazowy!G88","v":0},{"$f":"Zał.1_WPF_bazowy!H88","v":0},{"$f":"+Zał.1_WPF_bazowy!I88","v":0},{"$f":"+Zał.1_WPF_bazowy!J88","v":0},{"$f":"+Zał.1_WPF_bazowy!K88","v":0},{"$f":"+Zał.1_WPF_bazowy!L88","v":0},{"$f":"+Zał.1_WPF_bazowy!#REF!","v":{"$error":"#REF!"}},{"$f":"+Zał.1_WPF_bazowy!#REF!","v":{"$error":"#REF!"}},{"$f":"+Zał.1_WPF_bazowy!#REF!","v":{"$error":"#REF!"}},{"$f":"+Zał.1_WPF_bazowy!#REF!","v":{"$error":"#REF!"}},{"$f":"+Zał.1_WPF_bazowy!#REF!","v":{"$error":"#REF!"}},{"$f":"+Zał.1_WPF_bazowy!#REF!","v":{"$error":"#REF!"}},{"$f":"+Zał.1_WPF_bazowy!#REF!","v":{"$error":"#REF!"}},{"$f":"+Zał.1_WPF_bazowy!#REF!","v":{"$error":"#REF!"}},{"$f":"+Zał.1_WPF_bazowy!#REF!","v":{"$error":"#REF!"}},{"$f":"+Zał.1_WPF_bazowy!#REF!","v":{"$error":"#REF!"}},{"$f":"+Zał.1_WPF_bazowy!#REF!","v":{"$error":"#REF!"}},{"$f":"+Zał.1_WPF_bazowy!#REF!","v":{"$error":"#REF!"}},{"$f":"+Zał.1_WPF_bazowy!#REF!","v":{"$error":"#REF!"}},{"$f":"+Zał.1_WPF_bazowy!#REF!","v":{"$error":"#REF!"}},{"$f":"+Zał.1_WPF_bazowy!#REF!","v":{"$error":"#REF!"}},{"$f":"+Zał.1_WPF_bazowy!#REF!","v":{"$error":"#REF!"}},{"$f":"+Zał.1_WPF_bazowy!#REF!","v":{"$error":"#REF!"}},{"$f":"+Zał.1_WPF_bazowy!#REF!","v":{"$error":"#REF!"}},{"$f":"+Zał.1_WPF_bazowy!#REF!","v":{"$error":"#REF!"}},{"$f":"+Zał.1_WPF_bazowy!#REF!","v":{"$error":"#REF!"}},{"$f":"+Zał.1_WPF_bazowy!#REF!","v":{"$error":"#REF!"}},{"$f":"+Zał.1_WPF_bazowy!#REF!","v":{"$error":"#REF!"}},{"$f":"+Zał.1_WPF_bazowy!#REF!","v":{"$error":"#REF!"}},{"$f":"+Zał.1_WPF_bazowy!#REF!","v":{"$error":"#REF!"}},{"$f":"+Zał.1_WPF_bazowy!#REF!","v":{"$error":"#REF!"}},{"$f":"+Zał.1_WPF_bazowy!#REF!","v":{"$error":"#REF!"}}]
[null,"12.6",null,"Wydatki na wkład krajowy w związku z zawartą po dniu 1 stycznia 2013 r. umową na realizację programu, projektu lub zadania finansowanego w co najmniej 60% środkami, o których mowa w art. 5 ust. 1 pkt 2 ustawy",{"$f":"Zał.1_WPF_bazowy!E89","v":0},{"$f":"Zał.1_WPF_bazowy!F89","v":0},{"$f":"Zał.1_WPF_bazowy!G89","v":0},{"$f":"Zał.1_WPF_bazowy!H89","v":0},{"$f":"+Zał.1_WPF_bazowy!I89","v":0},{"$f":"+Zał.1_WPF_bazowy!J89","v":0},{"$f":"+Zał.1_WPF_bazowy!K89","v":0},{"$f":"+Zał.1_WPF_bazowy!L89","v":0},{"$f":"+Zał.1_WPF_bazowy!#REF!","v":{"$error":"#REF!"}},{"$f":"+Zał.1_WPF_bazowy!#REF!","v":{"$error":"#REF!"}},{"$f":"+Zał.1_WPF_bazowy!#REF!","v":{"$error":"#REF!"}},{"$f":"+Zał.1_WPF_bazowy!#REF!","v":{"$error":"#REF!"}},{"$f":"+Zał.1_WPF_bazowy!#REF!","v":{"$error":"#REF!"}},{"$f":"+Zał.1_WPF_bazowy!#REF!","v":{"$error":"#REF!"}},{"$f":"+Zał.1_WPF_bazowy!#REF!","v":{"$error":"#REF!"}},{"$f":"+Zał.1_WPF_bazowy!#REF!","v":{"$error":"#REF!"}},{"$f":"+Zał.1_WPF_bazowy!#REF!","v":{"$error":"#REF!"}},{"$f":"+Zał.1_WPF_bazowy!#REF!","v":{"$error":"#REF!"}},{"$f":"+Zał.1_WPF_bazowy!#REF!","v":{"$error":"#REF!"}},{"$f":"+Zał.1_WPF_bazowy!#REF!","v":{"$error":"#REF!"}},{"$f":"+Zał.1_WPF_bazowy!#REF!","v":{"$error":"#REF!"}},{"$f":"+Zał.1_WPF_bazowy!#REF!","v":{"$error":"#REF!"}},{"$f":"+Zał.1_WPF_bazowy!#REF!","v":{"$error":"#REF!"}},{"$f":"+Zał.1_WPF_bazowy!#REF!","v":{"$error":"#REF!"}},{"$f":"+Zał.1_WPF_bazowy!#REF!","v":{"$error":"#REF!"}},{"$f":"+Zał.1_WPF_bazowy!#REF!","v":{"$error":"#REF!"}},{"$f":"+Zał.1_WPF_bazowy!#REF!","v":{"$error":"#REF!"}},{"$f":"+Zał.1_WPF_bazowy!#REF!","v":{"$error":"#REF!"}},{"$f":"+Zał.1_WPF_bazowy!#REF!","v":{"$error":"#REF!"}},{"$f":"+Zał.1_WPF_bazowy!#REF!","v":{"$error":"#REF!"}},{"$f":"+Zał.1_WPF_bazowy!#REF!","v":{"$error":"#REF!"}},{"$f":"+Zał.1_WPF_bazowy!#REF!","v":{"$error":"#REF!"}},{"$f":"+Zał.1_WPF_bazowy!#REF!","v":{"$error":"#REF!"}},{"$f":"+Zał.1_WPF_bazowy!#REF!","v":{"$error":"#REF!"}}]
[null,"12.6.1",null,"w tym w związku z już zawartą umową na realizację programu, projektu lub zadania",{"$f":"Zał.1_WPF_bazowy!E90","v":0},{"$f":"Zał.1_WPF_bazowy!F90","v":0},{"$f":"Zał.1_WPF_bazowy!G90","v":0},{"$f":"Zał.1_WPF_bazowy!H90","v":0},{"$f":"+Zał.1_WPF_bazowy!I90","v":0},{"$f":"+Zał.1_WPF_bazowy!J90","v":0},{"$f":"+Zał.1_WPF_bazowy!K90","v":0},{"$f":"+Zał.1_WPF_bazowy!L90","v":0},{"$f":"+Zał.1_WPF_bazowy!#REF!","v":{"$error":"#REF!"}},{"$f":"+Zał.1_WPF_bazowy!#REF!","v":{"$error":"#REF!"}},{"$f":"+Zał.1_WPF_bazowy!#REF!","v":{"$error":"#REF!"}},{"$f":"+Zał.1_WPF_bazowy!#REF!","v":{"$error":"#REF!"}},{"$f":"+Zał.1_WPF_bazowy!#REF!","v":{"$error":"#REF!"}},{"$f":"+Zał.1_WPF_bazowy!#REF!","v":{"$error":"#REF!"}},{"$f":"+Zał.1_WPF_bazowy!#REF!","v":{"$error":"#REF!"}},{"$f":"+Zał.1_WPF_bazowy!#REF!","v":{"$error":"#REF!"}},{"$f":"+Zał.1_WPF_bazowy!#REF!","v":{"$error":"#REF!"}},{"$f":"+Zał.1_WPF_bazowy!#REF!","v":{"$error":"#REF!"}},{"$f":"+Zał.1_WPF_bazowy!#REF!","v":{"$error":"#REF!"}},{"$f":"+Zał.1_WPF_bazowy!#REF!","v":{"$error":"#REF!"}},{"$f":"+Zał.1_WPF_bazowy!#REF!","v":{"$error":"#REF!"}},{"$f":"+Zał.1_WPF_bazowy!#REF!","v":{"$error":"#REF!"}},{"$f":"+Zał.1_WPF_bazowy!#REF!","v":{"$error":"#REF!"}},{"$f":"+Zał.1_WPF_bazowy!#REF!","v":{"$error":"#REF!"}},{"$f":"+Zał.1_WPF_bazowy!#REF!","v":{"$error":"#REF!"}},{"$f":"+Zał.1_WPF_bazowy!#REF!","v":{"$error":"#REF!"}},{"$f":"+Zał.1_WPF_bazowy!#REF!","v":{"$error":"#REF!"}},{"$f":"+Zał.1_WPF_bazowy!#REF!","v":{"$error":"#REF!"}},{"$f":"+Zał.1_WPF_bazowy!#REF!","v":{"$error":"#REF!"}},{"$f":"+Zał.1_WPF_bazowy!#REF!","v":{"$error":"#REF!"}},{"$f":"+Zał.1_WPF_bazowy!#REF!","v":{"$error":"#REF!"}},{"$f":"+Zał.1_WPF_bazowy!#REF!","v":{"$error":"#REF!"}},{"$f":"+Zał.1_WPF_bazowy!#REF!","v":{"$error":"#REF!"}},{"$f":"+Zał.1_WPF_bazowy!#REF!","v":{"$error":"#REF!"}}]
[null,"12.7",null,"Przychody z tytułu kredytów, pożyczek, emisji papierów wartościowych powstające w związku z umową na realizację programu, projektu lub zadania finansowanego z udziałem środków, o których mowa w art. 5 ust. 1 pkt 2 ustawy bez względu na stopień finansowania tymi środkami ",{"$f":"Zał.1_WPF_bazowy!E91","v":0},{"$f":"Zał.1_WPF_bazowy!F91","v":0},{"$f":"Zał.1_WPF_bazowy!G91","v":0},{"$f":"Zał.1_WPF_bazowy!H91","v":0},{"$f":"+Zał.1_WPF_bazowy!I91","v":0},{"$f":"+Zał.1_WPF_bazowy!J91","v":0},{"$f":"+Zał.1_WPF_bazowy!K91","v":0},{"$f":"+Zał.1_WPF_bazowy!L91","v":0},{"$f":"+Zał.1_WPF_bazowy!#REF!","v":{"$error":"#REF!"}},{"$f":"+Zał.1_WPF_bazowy!#REF!","v":{"$error":"#REF!"}},{"$f":"+Zał.1_WPF_bazowy!#REF!","v":{"$error":"#REF!"}},{"$f":"+Zał.1_WPF_bazowy!#REF!","v":{"$error":"#REF!"}},{"$f":"+Zał.1_WPF_bazowy!#REF!","v":{"$error":"#REF!"}},{"$f":"+Zał.1_WPF_bazowy!#REF!","v":{"$error":"#REF!"}},{"$f":"+Zał.1_WPF_bazowy!#REF!","v":{"$error":"#REF!"}},{"$f":"+Zał.1_WPF_bazowy!#REF!","v":{"$error":"#REF!"}},{"$f":"+Zał.1_WPF_bazowy!#REF!","v":{"$error":"#REF!"}},{"$f":"+Zał.1_WPF_bazowy!#REF!","v":{"$error":"#REF!"}},{"$f":"+Zał.1_WPF_bazowy!#REF!","v":{"$error":"#REF!"}},{"$f":"+Zał.1_WPF_bazowy!#REF!","v":{"$error":"#REF!"}},{"$f":"+Zał.1_WPF_bazowy!#REF!","v":{"$error":"#REF!"}},{"$f":"+Zał.1_WPF_bazowy!#REF!","v":{"$error":"#REF!"}},{"$f":"+Zał.1_WPF_bazowy!#REF!","v":{"$error":"#REF!"}},{"$f":"+Zał.1_WPF_bazowy!#REF!","v":{"$error":"#REF!"}},{"$f":"+Zał.1_WPF_bazowy!#REF!","v":{"$error":"#REF!"}},{"$f":"+Zał.1_WPF_bazowy!#REF!","v":{"$error":"#REF!"}},{"$f":"+Zał.1_WPF_bazowy!#REF!","v":{"$error":"#REF!"}},{"$f":"+Zał.1_WPF_bazowy!#REF!","v":{"$error":"#REF!"}},{"$f":"+Zał.1_WPF_bazowy!#REF!","v":{"$error":"#REF!"}},{"$f":"+Zał.1_WPF_bazowy!#REF!","v":{"$error":"#REF!"}},{"$f":"+Zał.1_WPF_bazowy!#REF!","v":{"$error":"#REF!"}},{"$f":"+Zał.1_WPF_bazowy!#REF!","v":{"$error":"#REF!"}},{"$f":"+Zał.1_WPF_bazowy!#REF!","v":{"$error":"#REF!"}},{"$f":"+Zał.1_WPF_bazowy!#REF!","v":{"$error":"#REF!"}}]
[null,"12.7.1",null,"w tym w związku z już zawartą umową na realizację programu, projektu lub zadania",{"$f":"Zał.1_WPF_bazowy!E92","v":0},{"$f":"Zał.1_WPF_bazowy!F92","v":0},{"$f":"Zał.1_WPF_bazowy!G92","v":0},{"$f":"Zał.1_WPF_bazowy!H92","v":0},{"$f":"+Zał.1_WPF_bazowy!I92","v":0},{"$f":"+Zał.1_WPF_bazowy!J92","v":0},{"$f":"+Zał.1_WPF_bazowy!K92","v":0},{"$f":"+Zał.1_WPF_bazowy!L92","v":0},{"$f":"+Zał.1_WPF_bazowy!#REF!","v":{"$error":"#REF!"}},{"$f":"+Zał.1_WPF_bazowy!#REF!","v":{"$error":"#REF!"}},{"$f":"+Zał.1_WPF_bazowy!#REF!","v":{"$error":"#REF!"}},{"$f":"+Zał.1_WPF_bazowy!#REF!","v":{"$error":"#REF!"}},{"$f":"+Zał.1_WPF_bazowy!#REF!","v":{"$error":"#REF!"}},{"$f":"+Zał.1_WPF_bazowy!#REF!","v":{"$error":"#REF!"}},{"$f":"+Zał.1_WPF_bazowy!#REF!","v":{"$error":"#REF!"}},{"$f":"+Zał.1_WPF_bazowy!#REF!","v":{"$error":"#REF!"}},{"$f":"+Zał.1_WPF_bazowy!#REF!","v":{"$error":"#REF!"}},{"$f":"+Zał.1_WPF_bazowy!#REF!","v":{"$error":"#REF!"}},{"$f":"+Zał.1_WPF_bazowy!#REF!","v":{"$error":"#REF!"}},{"$f":"+Zał.1_WPF_bazowy!#REF!","v":{"$error":"#REF!"}},{"$f":"+Zał.1_WPF_bazowy!#REF!","v":{"$error":"#REF!"}},{"$f":"+Zał.1_WPF_bazowy!#REF!","v":{"$error":"#REF!"}},{"$f":"+Zał.1_WPF_bazowy!#REF!","v":{"$error":"#REF!"}},{"$f":"+Zał.1_WPF_bazowy!#REF!","v":{"$error":"#REF!"}},{"$f":"+Zał.1_WPF_bazowy!#REF!","v":{"$error":"#REF!"}},{"$f":"+Zał.1_WPF_bazowy!#REF!","v":{"$error":"#REF!"}},{"$f":"+Zał.1_WPF_bazowy!#REF!","v":{"$error":"#REF!"}},{"$f":"+Zał.1_WPF_bazowy!#REF!","v":{"$error":"#REF!"}},{"$f":"+Zał.1_WPF_bazowy!#REF!","v":{"$error":"#REF!"}},{"$f":"+Zał.1_WPF_bazowy!#REF!","v":{"$error":"#REF!"}},{"$f":"+Zał.1_WPF_bazowy!#REF!","v":{"$error":"#REF!"}},{"$f":"+Zał.1_WPF_bazowy!#REF!","v":{"$error":"#REF!"}},{"$f":"+Zał.1_WPF_bazowy!#REF!","v":{"$error":"#REF!"}},{"$f":"+Zał.1_WPF_bazowy!#REF!","v":{"$error":"#REF!"}}]
[null,"12.8",null,"Przychody z tytułu kredytów, pożyczek, emisji papierów wartościowych powstające w związku z zawartą po dniu 1 stycznia 2013 r. umową na realizację programu, projektu lub zadania finansowanego w co najmniej 60% środkami, o których mowa w art. 5 ust. 1 pkt 2 ustawy",{"$f":"Zał.1_WPF_bazowy!E93","v":0},{"$f":"Zał.1_WPF_bazowy!F93","v":0},{"$f":"Zał.1_WPF_bazowy!G93","v":0},{"$f":"Zał.1_WPF_bazowy!H93","v":0},{"$f":"+Zał.1_WPF_bazowy!I93","v":0},{"$f":"+Zał.1_WPF_bazowy!J93","v":0},{"$f":"+Zał.1_WPF_bazowy!K93","v":0},{"$f":"+Zał.1_WPF_bazowy!L93","v":0},{"$f":"+Zał.1_WPF_bazowy!#REF!","v":{"$error":"#REF!"}},{"$f":"+Zał.1_WPF_bazowy!#REF!","v":{"$error":"#REF!"}},{"$f":"+Zał.1_WPF_bazowy!#REF!","v":{"$error":"#REF!"}},{"$f":"+Zał.1_WPF_bazowy!#REF!","v":{"$error":"#REF!"}},{"$f":"+Zał.1_WPF_bazowy!#REF!","v":{"$error":"#REF!"}},{"$f":"+Zał.1_WPF_bazowy!#REF!","v":{"$error":"#REF!"}},{"$f":"+Zał.1_WPF_bazowy!#REF!","v":{"$error":"#REF!"}},{"$f":"+Zał.1_WPF_bazowy!#REF!","v":{"$error":"#REF!"}},{"$f":"+Zał.1_WPF_bazowy!#REF!","v":{"$error":"#REF!"}},{"$f":"+Zał.1_WPF_bazowy!#REF!","v":{"$error":"#REF!"}},{"$f":"+Zał.1_WPF_bazowy!#REF!","v":{"$error":"#REF!"}},{"$f":"+Zał.1_WPF_bazowy!#REF!","v":{"$error":"#REF!"}},{"$f":"+Zał.1_WPF_bazowy!#REF!","v":{"$error":"#REF!"}},{"$f":"+Zał.1_WPF_bazowy!#REF!","v":{"$error":"#REF!"}},{"$f":"+Zał.1_WPF_bazowy!#REF!","v":{"$error":"#REF!"}},{"$f":"+Zał.1_WPF_bazowy!#REF!","v":{"$error":"#REF!"}},{"$f":"+Zał.1_WPF_bazowy!#REF!","v":{"$error":"#REF!"}},{"$f":"+Zał.1_WPF_bazowy!#REF!","v":{"$error":"#REF!"}},{"$f":"+Zał.1_WPF_bazowy!#REF!","v":{"$error":"#REF!"}},{"$f":"+Zał.1_WPF_bazowy!#REF!","v":{"$error":"#REF!"}},{"$f":"+Zał.1_WPF_bazowy!#REF!","v":{"$error":"#REF!"}},{"$f":"+Zał.1_WPF_bazowy!#REF!","v":{"$error":"#REF!"}},{"$f":"+Zał.1_WPF_bazowy!#REF!","v":{"$error":"#REF!"}},{"$f":"+Zał.1_WPF_bazowy!#REF!","v":{"$error":"#REF!"}},{"$f":"+Zał.1_WPF_bazowy!#REF!","v":{"$error":"#REF!"}},{"$f":"+Zał.1_WPF_bazowy!#REF!","v":{"$error":"#REF!"}}]
[null,"12.8.1",null,"w tym w związku z już zawartą umową na realizację programu, projektu lub zadania",{"$f":"Zał.1_WPF_bazowy!E94","v":0},{"$f":"Zał.1_WPF_bazowy!F94","v":0},{"$f":"Zał.1_WPF_bazowy!G94","v":0},{"$f":"Zał.1_WPF_bazowy!H94","v":0},{"$f":"+Zał.1_WPF_bazowy!I94","v":0},{"$f":"+Zał.1_WPF_bazowy!J94","v":0},{"$f":"+Zał.1_WPF_bazowy!K94","v":0},{"$f":"+Zał.1_WPF_bazowy!L94","v":0},{"$f":"+Zał.1_WPF_bazowy!#REF!","v":{"$error":"#REF!"}},{"$f":"+Zał.1_WPF_bazowy!#REF!","v":{"$error":"#REF!"}},{"$f":"+Zał.1_WPF_bazowy!#REF!","v":{"$error":"#REF!"}},{"$f":"+Zał.1_WPF_bazowy!#REF!","v":{"$error":"#REF!"}},{"$f":"+Zał.1_WPF_bazowy!#REF!","v":{"$error":"#REF!"}},{"$f":"+Zał.1_WPF_bazowy!#REF!","v":{"$error":"#REF!"}},{"$f":"+Zał.1_WPF_bazowy!#REF!","v":{"$error":"#REF!"}},{"$f":"+Zał.1_WPF_bazowy!#REF!","v":{"$error":"#REF!"}},{"$f":"+Zał.1_WPF_bazowy!#REF!","v":{"$error":"#REF!"}},{"$f":"+Zał.1_WPF_bazowy!#REF!","v":{"$error":"#REF!"}},{"$f":"+Zał.1_WPF_bazowy!#REF!","v":{"$error":"#REF!"}},{"$f":"+Zał.1_WPF_bazowy!#REF!","v":{"$error":"#REF!"}},{"$f":"+Zał.1_WPF_bazowy!#REF!","v":{"$error":"#REF!"}},{"$f":"+Zał.1_WPF_bazowy!#REF!","v":{"$error":"#REF!"}},{"$f":"+Zał.1_WPF_bazowy!#REF!","v":{"$error":"#REF!"}},{"$f":"+Zał.1_WPF_bazowy!#REF!","v":{"$error":"#REF!"}},{"$f":"+Zał.1_WPF_bazowy!#REF!","v":{"$error":"#REF!"}},{"$f":"+Zał.1_WPF_bazowy!#REF!","v":{"$error":"#REF!"}},{"$f":"+Zał.1_WPF_bazowy!#REF!","v":{"$error":"#REF!"}},{"$f":"+Zał.1_WPF_bazowy!#REF!","v":{"$error":"#REF!"}},{"$f":"+Zał.1_WPF_bazowy!#REF!","v":{"$error":"#REF!"}},{"$f":"+Zał.1_WPF_bazowy!#REF!","v":{"$error":"#REF!"}},{"$f":"+Zał.1_WPF_bazowy!#REF!","v":{"$error":"#REF!"}},{"$f":"+Zał.1_WPF_bazowy!#REF!","v":{"$error":"#REF!"}},{"$f":"+Zał.1_WPF_bazowy!#REF!","v":{"$error":"#REF!"}},{"$f":"+Zał.1_WPF_bazowy!#REF!","v":{"$error":"#REF!"}}]
[null,13,null,"Kwoty dotyczące przejęcia i spłaty zobowiązań po samodzielnych publicznych zakładach opieki zdrowotnej oraz pokrycia ujemnego wyniku ","x","x","x","x","x","x","x","x","x","x","x","x","x","x","x","x","x","x","x","x","x","x","x","x","x","x","x","x","x","x","x","x","x","x"]
[null,"13.1",null,"Kwota zobowiązań wynikających z przejęcia przez jednostkę samorządu terytorialnego zobowiązań po likwidowanych i przekształcanych samodzielnych zakładach opieki zdrowotnej",{"$f":"Zał.1_WPF_bazowy!E96","v":0},{"$f":"Zał.1_WPF_bazowy!F96","v":0},{"$f":"Zał.1_WPF_bazowy!G96","v":0},{"$f":"Zał.1_WPF_bazowy!H96","v":0},{"$f":"+IF(I10<>0,H96-(I98+I99+I100+I101),0)","v":0},0,0,0,{"$error":"#REF!"},{"$error":"#REF!"},{"$error":"#REF!"},{"$error":"#REF!"},{"$error":"#REF!"},{"$error":"#REF!"},{"$error":"#REF!"},{"$error":"#REF!"},{"$error":"#REF!"},{"$error":"#REF!"},{"$error":"#REF!"},{"$error":"#REF!"},{"$error":"#REF!"},{"$error":"#REF!"},{"$error":"#REF!"},{"$error":"#REF!"},{"$error":"#REF!"},{"$error":"#REF!"},{"$error":"#REF!"},{"$error":"#REF!"},{"$error":"#REF!"},{"$error":"#REF!"},{"$error":"#REF!"},{"$error":"#REF!"},{"$error":"#REF!"},{"$error":"#REF!"}]
[null,"13.2",null,"Dochody budżetowe z tytułu dotacji celowej z budżetu państwa, o której mowa w art. 196 ustawy z  dnia 15 kwietnia 2011 r.  o działalności leczniczej (Dz.U. Nr 112, poz. 654, z późn. zm.)",{"$f":"Zał.1_WPF_bazowy!E97","v":0},{"$f":"Zał.1_WPF_bazowy!F97","v":0},{"$f":"Zał.1_WPF_bazowy!G97","v":0},{"$f":"Zał.1_WPF_bazowy!H97","v":0},{"$f":"+Zał.1_WPF_bazowy!I97","v":0},{"$f":"+Zał.1_WPF_bazowy!J97","v":0},{"$f":"+Zał.1_WPF_bazowy!K97","v":0},{"$f":"+Zał.1_WPF_bazowy!L97","v":0},{"$f":"+Zał.1_WPF_bazowy!#REF!","v":{"$error":"#REF!"}},{"$f":"+Zał.1_WPF_bazowy!#REF!","v":{"$error":"#REF!"}},{"$f":"+Zał.1_WPF_bazowy!#REF!","v":{"$error":"#REF!"}},{"$f":"+Zał.1_WPF_bazowy!#REF!","v":{"$error":"#REF!"}},{"$f":"+Zał.1_WPF_bazowy!#REF!","v":{"$error":"#REF!"}},{"$f":"+Zał.1_WPF_bazowy!#REF!","v":{"$error":"#REF!"}},{"$f":"+Zał.1_WPF_bazowy!#REF!","v":{"$error":"#REF!"}},{"$f":"+Zał.1_WPF_bazowy!#REF!","v":{"$error":"#REF!"}},{"$f":"+Zał.1_WPF_bazowy!#REF!","v":{"$error":"#REF!"}},{"$f":"+Zał.1_WPF_bazowy!#REF!","v":{"$error":"#REF!"}},{"$f":"+Zał.1_WPF_bazowy!#REF!","v":{"$error":"#REF!"}},{"$f":"+Zał.1_WPF_bazowy!#REF!","v":{"$error":"#REF!"}},{"$f":"+Zał.1_WPF_bazowy!#REF!","v":{"$error":"#REF!"}},{"$f":"+Zał.1_WPF_bazowy!#REF!","v":{"$error":"#REF!"}},{"$f":"+Zał.1_WPF_bazowy!#REF!","v":{"$error":"#REF!"}},{"$f":"+Zał.1_WPF_bazowy!#REF!","v":{"$error":"#REF!"}},{"$f":"+Zał.1_WPF_bazowy!#REF!","v":{"$error":"#REF!"}},{"$f":"+Zał.1_WPF_bazowy!#REF!","v":{"$error":"#REF!"}},{"$f":"+Zał.1_WPF_bazowy!#REF!","v":{"$error":"#REF!"}},{"$f":"+Zał.1_WPF_bazowy!#REF!","v":{"$error":"#REF!"}},{"$f":"+Zał.1_WPF_bazowy!#REF!","v":{"$error":"#REF!"}},{"$f":"+Zał.1_WPF_bazowy!#REF!","v":{"$error":"#REF!"}},{"$f":"+Zał.1_WPF_bazowy!#REF!","v":{"$error":"#REF!"}},{"$f":"+Zał.1_WPF_bazowy!#REF!","v":{"$error":"#REF!"}},{"$f":"+Zał.1_WPF_bazowy!#REF!","v":{"$error":"#REF!"}},{"$f":"+Zał.1_WPF_bazowy!#REF!","v":{"$error":"#REF!"}}]
[null,"13.3",null,"Wysokość zobowiązań podlegających umorzeniu, o którym mowa w art. 190 ustawy o działalności leczniczej",{"$f":"Zał.1_WPF_bazowy!E98","v":0},{"$f":"Zał.1_WPF_bazowy!F98","v":0},{"$f":"Zał.1_WPF_bazowy!G98","v":0},{"$f":"Zał.1_WPF_bazowy!H98","v":0},{"$f":"+Zał.1_WPF_bazowy!I98","v":0},{"$f":"+Zał.1_WPF_bazowy!J98","v":0},{"$f":"+Zał.1_WPF_bazowy!K98","v":0},{"$f":"+Zał.1_WPF_bazowy!L98","v":0},{"$f":"+Zał.1_WPF_bazowy!#REF!","v":{"$error":"#REF!"}},{"$f":"+Zał.1_WPF_bazowy!#REF!","v":{"$error":"#REF!"}},{"$f":"+Zał.1_WPF_bazowy!#REF!","v":{"$error":"#REF!"}},{"$f":"+Zał.1_WPF_bazowy!#REF!","v":{"$error":"#REF!"}},{"$f":"+Zał.1_WPF_bazowy!#REF!","v":{"$error":"#REF!"}},{"$f":"+Zał.1_WPF_bazowy!#REF!","v":{"$error":"#REF!"}},{"$f":"+Zał.1_WPF_bazowy!#REF!","v":{"$error":"#REF!"}},{"$f":"+Zał.1_WPF_bazowy!#REF!","v":{"$error":"#REF!"}},{"$f":"+Zał.1_WPF_bazowy!#REF!","v":{"$error":"#REF!"}},{"$f":"+Zał.1_WPF_bazowy!#REF!","v":{"$error":"#REF!"}},{"$f":"+Zał.1_WPF_bazowy!#REF!","v":{"$error":"#REF!"}},{"$f":"+Zał.1_WPF_bazowy!#REF!","v":{"$error":"#REF!"}},{"$f":"+Zał.1_WPF_bazowy!#REF!","v":{"$error":"#REF!"}},{"$f":"+Zał.1_WPF_bazowy!#REF!","v":{"$error":"#REF!"}},{"$f":"+Zał.1_WPF_bazowy!#REF!","v":{"$error":"#REF!"}},{"$f":"+Zał.1_WPF_bazowy!#REF!","v":{"$error":"#REF!"}},{"$f":"+Zał.1_WPF_bazowy!#REF!","v":{"$error":"#REF!"}},{"$f":"+Zał.1_WPF_bazowy!#REF!","v":{"$error":"#REF!"}},{"$f":"+Zał.1_WPF_bazowy!#REF!","v":{"$error":"#REF!"}},{"$f":"+Zał.1_WPF_bazowy!#REF!","v":{"$error":"#REF!"}},{"$f":"+Zał.1_WPF_bazowy!#REF!","v":{"$error":"#REF!"}},{"$f":"+Zał.1_WPF_bazowy!#REF!","v":{"$error":"#REF!"}},{"$f":"+Zał.1_WPF_bazowy!#REF!","v":{"$error":"#REF!"}},{"$f":"+Zał.1_WPF_bazowy!#REF!","v":{"$error":"#REF!"}},{"$f":"+Zał.1_WPF_bazowy!#REF!","v":{"$error":"#REF!"}},{"$f":"+Zał.1_WPF_bazowy!#REF!","v":{"$error":"#REF!"}}]
[null,"13.4",null,"Wydatki na spłatę przejętych zobowiązań samodzielnego publicznego zakładu opieki zdrowotnej przekształconego na zasadach określonych w przepisach  o działalności leczniczej",{"$f":"Zał.1_WPF_bazowy!E99","v":0},{"$f":"Zał.1_WPF_bazowy!F99","v":0},{"$f":"Zał.1_WPF_bazowy!G99","v":0},{"$f":"Zał.1_WPF_bazowy!H99","v":0},{"$f":"+Zał.1_WPF_bazowy!I99","v":0},{"$f":"+Zał.1_WPF_bazowy!J99","v":0},{"$f":"+Zał.1_WPF_bazowy!K99","v":0},{"$f":"+Zał.1_WPF_bazowy!L99","v":0},{"$f":"+Zał.1_WPF_bazowy!#REF!","v":{"$error":"#REF!"}},{"$f":"+Zał.1_WPF_bazowy!#REF!","v":{"$error":"#REF!"}},{"$f":"+Zał.1_WPF_bazowy!#REF!","v":{"$error":"#REF!"}},{"$f":"+Zał.1_WPF_bazowy!#REF!","v":{"$error":"#REF!"}},{"$f":"+Zał.1_WPF_bazowy!#REF!","v":{"$error":"#REF!"}},{"$f":"+Zał.1_WPF_bazowy!#REF!","v":{"$error":"#REF!"}},{"$f":"+Zał.1_WPF_bazowy!#REF!","v":{"$error":"#REF!"}},{"$f":"+Zał.1_WPF_bazowy!#REF!","v":{"$error":"#REF!"}},{"$f":"+Zał.1_WPF_bazowy!#REF!","v":{"$error":"#REF!"}},{"$f":"+Zał.1_WPF_bazowy!#REF!","v":{"$error":"#REF!"}},{"$f":"+Zał.1_WPF_bazowy!#REF!","v":{"$error":"#REF!"}},{"$f":"+Zał.1_WPF_bazowy!#REF!","v":{"$error":"#REF!"}},{"$f":"+Zał.1_WPF_bazowy!#REF!","v":{"$error":"#REF!"}},{"$f":"+Zał.1_WPF_bazowy!#REF!","v":{"$error":"#REF!"}},{"$f":"+Zał.1_WPF_bazowy!#REF!","v":{"$error":"#REF!"}},{"$f":"+Zał.1_WPF_bazowy!#REF!","v":{"$error":"#REF!"}},{"$f":"+Zał.1_WPF_bazowy!#REF!","v":{"$error":"#REF!"}},{"$f":"+Zał.1_WPF_bazowy!#REF!","v":{"$error":"#REF!"}},{"$f":"+Zał.1_WPF_bazowy!#REF!","v":{"$error":"#REF!"}},{"$f":"+Zał.1_WPF_bazowy!#REF!","v":{"$error":"#REF!"}},{"$f":"+Zał.1_WPF_bazowy!#REF!","v":{"$error":"#REF!"}},{"$f":"+Zał.1_WPF_bazowy!#REF!","v":{"$error":"#REF!"}},{"$f":"+Zał.1_WPF_bazowy!#REF!","v":{"$error":"#REF!"}},{"$f":"+Zał.1_WPF_bazowy!#REF!","v":{"$error":"#REF!"}},{"$f":"+Zał.1_WPF_bazowy!#REF!","v":{"$error":"#REF!"}},{"$f":"+Zał.1_WPF_bazowy!#REF!","v":{"$error":"#REF!"}}]
[null,"13.5",null,"Wydatki na spłatę przejętych zobowiązań samodzielnego publicznego zakładu opieki zdrowotnej likwidowanego na zasadach określonych w przepisach  o działalności leczniczej",{"$f":"Zał.1_WPF_bazowy!E100","v":0},{"$f":"Zał.1_WPF_bazowy!F100","v":0},{"$f":"Zał.1_WPF_bazowy!G100","v":0},{"$f":"Zał.1_WPF_bazowy!H100","v":0},{"$f":"+Zał.1_WPF_bazowy!I100","v":0},{"$f":"+Zał.1_WPF_bazowy!J100","v":0},{"$f":"+Zał.1_WPF_bazowy!K100","v":0},{"$f":"+Zał.1_WPF_bazowy!L100","v":0},{"$f":"+Zał.1_WPF_bazowy!#REF!","v":{"$error":"#REF!"}},{"$f":"+Zał.1_WPF_bazowy!#REF!","v":{"$error":"#REF!"}},{"$f":"+Zał.1_WPF_bazowy!#REF!","v":{"$error":"#REF!"}},{"$f":"+Zał.1_WPF_bazowy!#REF!","v":{"$error":"#REF!"}},{"$f":"+Zał.1_WPF_bazowy!#REF!","v":{"$error":"#REF!"}},{"$f":"+Zał.1_WPF_bazowy!#REF!","v":{"$error":"#REF!"}},{"$f":"+Zał.1_WPF_bazowy!#REF!","v":{"$error":"#REF!"}},{"$f":"+Zał.1_WPF_bazowy!#REF!","v":{"$error":"#REF!"}},{"$f":"+Zał.1_WPF_bazowy!#REF!","v":{"$error":"#REF!"}},{"$f":"+Zał.1_WPF_bazowy!#REF!","v":{"$error":"#REF!"}},{"$f":"+Zał.1_WPF_bazowy!#REF!","v":{"$error":"#REF!"}},{"$f":"+Zał.1_WPF_bazowy!#REF!","v":{"$error":"#REF!"}},{"$f":"+Zał.1_WPF_bazowy!#REF!","v":{"$error":"#REF!"}},{"$f":"+Zał.1_WPF_bazowy!#REF!","v":{"$error":"#REF!"}},{"$f":"+Zał.1_WPF_bazowy!#REF!","v":{"$error":"#REF!"}},{"$f":"+Zał.1_WPF_bazowy!#REF!","v":{"$error":"#REF!"}},{"$f":"+Zał.1_WPF_bazowy!#REF!","v":{"$error":"#REF!"}},{"$f":"+Zał.1_WPF_bazowy!#REF!","v":{"$error":"#REF!"}},{"$f":"+Zał.1_WPF_bazowy!#REF!","v":{"$error":"#REF!"}},{"$f":"+Zał.1_WPF_bazowy!#REF!","v":{"$error":"#REF!"}},{"$f":"+Zał.1_WPF_bazowy!#REF!","v":{"$error":"#REF!"}},{"$f":"+Zał.1_WPF_bazowy!#REF!","v":{"$error":"#REF!"}},{"$f":"+Zał.1_WPF_bazowy!#REF!","v":{"$error":"#REF!"}},{"$f":"+Zał.1_WPF_bazowy!#REF!","v":{"$error":"#REF!"}},{"$f":"+Zał.1_WPF_bazowy!#REF!","v":{"$error":"#REF!"}},{"$f":"+Zał.1_WPF_bazowy!#REF!","v":{"$error":"#REF!"}}]
[null,"13.6",null,"Wydatki na spłatę zobowiązań samodzielnego publicznego zakładu opieki zdrowotnej przejętych do końca 2011 r. na podstawie przepisów o zakładach opieki zdrowotnej",{"$f":"Zał.1_WPF_bazowy!E101","v":0},{"$f":"Zał.1_WPF_bazowy!F101","v":0},{"$f":"Zał.1_WPF_bazowy!G101","v":0},{"$f":"Zał.1_WPF_bazowy!H101","v":0},{"$f":"+Zał.1_WPF_bazowy!I101","v":0},{"$f":"+Zał.1_WPF_bazowy!J101","v":0},{"$f":"+Zał.1_WPF_bazowy!K101","v":0},{"$f":"+Zał.1_WPF_bazowy!L101","v":0},{"$f":"+Zał.1_WPF_bazowy!#REF!","v":{"$error":"#REF!"}},{"$f":"+Zał.1_WPF_bazowy!#REF!","v":{"$error":"#REF!"}},{"$f":"+Zał.1_WPF_bazowy!#REF!","v":{"$error":"#REF!"}},{"$f":"+Zał.1_WPF_bazowy!#REF!","v":{"$error":"#REF!"}},{"$f":"+Zał.1_WPF_bazowy!#REF!","v":{"$error":"#REF!"}},{"$f":"+Zał.1_WPF_bazowy!#REF!","v":{"$error":"#REF!"}},{"$f":"+Zał.1_WPF_bazowy!#REF!","v":{"$error":"#REF!"}},{"$f":"+Zał.1_WPF_bazowy!#REF!","v":{"$error":"#REF!"}},{"$f":"+Zał.1_WPF_bazowy!#REF!","v":{"$error":"#REF!"}},{"$f":"+Zał.1_WPF_bazowy!#REF!","v":{"$error":"#REF!"}},{"$f":"+Zał.1_WPF_bazowy!#REF!","v":{"$error":"#REF!"}},{"$f":"+Zał.1_WPF_bazowy!#REF!","v":{"$error":"#REF!"}},{"$f":"+Zał.1_WPF_bazowy!#REF!","v":{"$error":"#REF!"}},{"$f":"+Zał.1_WPF_bazowy!#REF!","v":{"$error":"#REF!"}},{"$f":"+Zał.1_WPF_bazowy!#REF!","v":{"$error":"#REF!"}},{"$f":"+Zał.1_WPF_bazowy!#REF!","v":{"$error":"#REF!"}},{"$f":"+Zał.1_WPF_bazowy!#REF!","v":{"$error":"#REF!"}},{"$f":"+Zał.1_WPF_bazowy!#REF!","v":{"$error":"#REF!"}},{"$f":"+Zał.1_WPF_bazowy!#REF!","v":{"$error":"#REF!"}},{"$f":"+Zał.1_WPF_bazowy!#REF!","v":{"$error":"#REF!"}},{"$f":"+Zał.1_WPF_bazowy!#REF!","v":{"$error":"#REF!"}},{"$f":"+Zał.1_WPF_bazowy!#REF!","v":{"$error":"#REF!"}},{"$f":"+Zał.1_WPF_bazowy!#REF!","v":{"$error":"#REF!"}},{"$f":"+Zał.1_WPF_bazowy!#REF!","v":{"$error":"#REF!"}},{"$f":"+Zał.1_WPF_bazowy!#REF!","v":{"$error":"#REF!"}},{"$f":"+Zał.1_WPF_bazowy!#REF!","v":{"$error":"#REF!"}}]
[null,"13.7",null,"Wydatki bieżące na pokrycie ujemnego wyniku finansowego samodzielnego publicznego zakładu opieki zdrowotnej",{"$f":"Zał.1_WPF_bazowy!E102","v":0},{"$f":"Zał.1_WPF_bazowy!F102","v":0},{"$f":"Zał.1_WPF_bazowy!G102","v":0},{"$f":"Zał.1_WPF_bazowy!H102","v":0},{"$f":"+Zał.1_WPF_bazowy!I102","v":0},{"$f":"+Zał.1_WPF_bazowy!J102","v":0},{"$f":"+Zał.1_WPF_bazowy!K102","v":0},{"$f":"+Zał.1_WPF_bazowy!L102","v":0},{"$f":"+Zał.1_WPF_bazowy!#REF!","v":{"$error":"#REF!"}},{"$f":"+Zał.1_WPF_bazowy!#REF!","v":{"$error":"#REF!"}},{"$f":"+Zał.1_WPF_bazowy!#REF!","v":{"$error":"#REF!"}},{"$f":"+Zał.1_WPF_bazowy!#REF!","v":{"$error":"#REF!"}},{"$f":"+Zał.1_WPF_bazowy!#REF!","v":{"$error":"#REF!"}},{"$f":"+Zał.1_WPF_bazowy!#REF!","v":{"$error":"#REF!"}},{"$f":"+Zał.1_WPF_bazowy!#REF!","v":{"$error":"#REF!"}},{"$f":"+Zał.1_WPF_bazowy!#REF!","v":{"$error":"#REF!"}},{"$f":"+Zał.1_WPF_bazowy!#REF!","v":{"$error":"#REF!"}},{"$f":"+Zał.1_WPF_bazowy!#REF!","v":{"$error":"#REF!"}},{"$f":"+Zał.1_WPF_bazowy!#REF!","v":{"$error":"#REF!"}},{"$f":"+Zał.1_WPF_bazowy!#REF!","v":{"$error":"#REF!"}},{"$f":"+Zał.1_WPF_bazowy!#REF!","v":{"$error":"#REF!"}},{"$f":"+Zał.1_WPF_bazowy!#REF!","v":{"$error":"#REF!"}},{"$f":"+Zał.1_WPF_bazowy!#REF!","v":{"$error":"#REF!"}},{"$f":"+Zał.1_WPF_bazowy!#REF!","v":{"$error":"#REF!"}},{"$f":"+Zał.1_WPF_bazowy!#REF!","v":{"$error":"#REF!"}},{"$f":"+Zał.1_WPF_bazowy!#REF!","v":{"$error":"#REF!"}},{"$f":"+Zał.1_WPF_bazowy!#REF!","v":{"$error":"#REF!"}},{"$f":"+Zał.1_WPF_bazowy!#REF!","v":{"$error":"#REF!"}},{"$f":"+Zał.1_WPF_bazowy!#REF!","v":{"$error":"#REF!"}},{"$f":"+Zał.1_WPF_bazowy!#REF!","v":{"$error":"#REF!"}},{"$f":"+Zał.1_WPF_bazowy!#REF!","v":{"$error":"#REF!"}},{"$f":"+Zał.1_WPF_bazowy!#REF!","v":{"$error":"#REF!"}},{"$f":"+Zał.1_WPF_bazowy!#REF!","v":{"$error":"#REF!"}},{"$f":"+Zał.1_WPF_bazowy!#REF!","v":{"$error":"#REF!"}}]
["x",14,null,"Dane uzupełniające o długu i jego spłacie","x","x","x","x","x","x","x","x","x","x","x","x","x","x","x","x","x","x","x","x","x","x","x","x","x","x","x","x","x","x","x","x","x","x"]
["x","14.1",null,"Spłaty rat kapitałowych oraz wykup papierów wartościowych, o których mowa w pkt. 5.1., wynikające wyłącznie z tytułu zobowiązań już zaciągniętych",{"$f":"Zał.1_WPF_bazowy!E104","v":1278520.75},{"$f":"Zał.1_WPF_bazowy!F104","v":737521.46},{"$f":"Zał.1_WPF_bazowy!G104","v":773956.19},{"$f":"Zał.1_WPF_bazowy!H104","v":604776.59},{"$f":"+Zał.1_WPF_bazowy!I104","v":169179.6},{"$f":"+Zał.1_WPF_bazowy!J104","v":701400},{"$f":"+Zał.1_WPF_bazowy!K104","v":701387.6},{"$f":"+Zał.1_WPF_bazowy!L104","v":0},{"$f":"+Zał.1_WPF_bazowy!#REF!","v":{"$error":"#REF!"}},{"$f":"+Zał.1_WPF_bazowy!#REF!","v":{"$error":"#REF!"}},{"$f":"+Zał.1_WPF_bazowy!#REF!","v":{"$error":"#REF!"}},{"$f":"+Zał.1_WPF_bazowy!#REF!","v":{"$error":"#REF!"}},{"$f":"+Zał.1_WPF_bazowy!#REF!","v":{"$error":"#REF!"}},{"$f":"+Zał.1_WPF_bazowy!#REF!","v":{"$error":"#REF!"}},{"$f":"+Zał.1_WPF_bazowy!#REF!","v":{"$error":"#REF!"}},{"$f":"+Zał.1_WPF_bazowy!#REF!","v":{"$error":"#REF!"}},{"$f":"+Zał.1_WPF_bazowy!#REF!","v":{"$error":"#REF!"}},{"$f":"+Zał.1_WPF_bazowy!#REF!","v":{"$error":"#REF!"}},{"$f":"+Zał.1_WPF_bazowy!#REF!","v":{"$error":"#REF!"}},{"$f":"+Zał.1_WPF_bazowy!#REF!","v":{"$error":"#REF!"}},{"$f":"+Zał.1_WPF_bazowy!#REF!","v":{"$error":"#REF!"}},{"$f":"+Zał.1_WPF_bazowy!#REF!","v":{"$error":"#REF!"}},{"$f":"+Zał.1_WPF_bazowy!#REF!","v":{"$error":"#REF!"}},{"$f":"+Zał.1_WPF_bazowy!#REF!","v":{"$error":"#REF!"}},{"$f":"+Zał.1_WPF_bazowy!#REF!","v":{"$error":"#REF!"}},{"$f":"+Zał.1_WPF_bazowy!#REF!","v":{"$error":"#REF!"}},{"$f":"+Zał.1_WPF_bazowy!#REF!","v":{"$error":"#REF!"}},{"$f":"+Zał.1_WPF_bazowy!#REF!","v":{"$error":"#REF!"}},{"$f":"+Zał.1_WPF_bazowy!#REF!","v":{"$error":"#REF!"}},{"$f":"+Zał.1_WPF_bazowy!#REF!","v":{"$error":"#REF!"}},{"$f":"+Zał.1_WPF_bazowy!#REF!","v":{"$error":"#REF!"}},{"$f":"+Zał.1_WPF_bazowy!#REF!","v":{"$error":"#REF!"}},{"$f":"+Zał.1_WPF_bazowy!#REF!","v":{"$error":"#REF!"}},{"$f":"+Zał.1_WPF_bazowy!#REF!","v":{"$error":"#REF!"}}]
["x","14.2",null,"Kwota długu, którego planowana spłata dokona się z wydatków budżetu",{"$f":"Zał.1_WPF_bazowy!E105","v":0},{"$f":"Zał.1_WPF_bazowy!F105","v":0},{"$f":"Zał.1_WPF_bazowy!G105","v":0},{"$f":"Zał.1_WPF_bazowy!H105","v":0},{"$f":"+Zał.1_WPF_bazowy!I105","v":0},{"$f":"+Zał.1_WPF_bazowy!J105","v":0},{"$f":"+Zał.1_WPF_bazowy!K105","v":0},{"$f":"+Zał.1_WPF_bazowy!L105","v":0},{"$f":"+Zał.1_WPF_bazowy!#REF!","v":{"$error":"#REF!"}},{"$f":"+Zał.1_WPF_bazowy!#REF!","v":{"$error":"#REF!"}},{"$f":"+Zał.1_WPF_bazowy!#REF!","v":{"$error":"#REF!"}},{"$f":"+Zał.1_WPF_bazowy!#REF!","v":{"$error":"#REF!"}},{"$f":"+Zał.1_WPF_bazowy!#REF!","v":{"$error":"#REF!"}},{"$f":"+Zał.1_WPF_bazowy!#REF!","v":{"$error":"#REF!"}},{"$f":"+Zał.1_WPF_bazowy!#REF!","v":{"$error":"#REF!"}},{"$f":"+Zał.1_WPF_bazowy!#REF!","v":{"$error":"#REF!"}},{"$f":"+Zał.1_WPF_bazowy!#REF!","v":{"$error":"#REF!"}},{"$f":"+Zał.1_WPF_bazowy!#REF!","v":{"$error":"#REF!"}},{"$f":"+Zał.1_WPF_bazowy!#REF!","v":{"$error":"#REF!"}},{"$f":"+Zał.1_WPF_bazowy!#REF!","v":{"$error":"#REF!"}},{"$f":"+Zał.1_WPF_bazowy!#REF!","v":{"$error":"#REF!"}},{"$f":"+Zał.1_WPF_bazowy!#REF!","v":{"$error":"#REF!"}},{"$f":"+Zał.1_WPF_bazowy!#REF!","v":{"$error":"#REF!"}},{"$f":"+Zał.1_WPF_bazowy!#REF!","v":{"$error":"#REF!"}},{"$f":"+Zał.1_WPF_bazowy!#REF!","v":{"$error":"#REF!"}},{"$f":"+Zał.1_WPF_bazowy!#REF!","v":{"$error":"#REF!"}},{"$f":"+Zał.1_WPF_bazowy!#REF!","v":{"$error":"#REF!"}},{"$f":"+Zał.1_WPF_bazowy!#REF!","v":{"$error":"#REF!"}},{"$f":"+Zał.1_WPF_bazowy!#REF!","v":{"$error":"#REF!"}},{"$f":"+Zał.1_WPF_bazowy!#REF!","v":{"$error":"#REF!"}},{"$f":"+Zał.1_WPF_bazowy!#REF!","v":{"$error":"#REF!"}},{"$f":"+Zał.1_WPF_bazowy!#REF!","v":{"$error":"#REF!"}},{"$f":"+Zał.1_WPF_bazowy!#REF!","v":{"$error":"#REF!"}},{"$f":"+Zał.1_WPF_bazowy!#REF!","v":{"$error":"#REF!"}}]
["x","14.3",null,"Wydatki zmniejszające dług, w tym",{"$f":"Zał.1_WPF_bazowy!E106","v":0},{"$f":"Zał.1_WPF_bazowy!F106","v":0},{"$f":"Zał.1_WPF_bazowy!G106","v":0},{"$f":"Zał.1_WPF_bazowy!H106","v":0},{"$f":"+Zał.1_WPF_bazowy!I106","v":0},{"$f":"+Zał.1_WPF_bazowy!J106","v":0},{"$f":"+Zał.1_WPF_bazowy!K106","v":0},{"$f":"+Zał.1_WPF_bazowy!L106","v":0},{"$f":"+Zał.1_WPF_bazowy!#REF!","v":{"$error":"#REF!"}},{"$f":"+Zał.1_WPF_bazowy!#REF!","v":{"$error":"#REF!"}},{"$f":"+Zał.1_WPF_bazowy!#REF!","v":{"$error":"#REF!"}},{"$f":"+Zał.1_WPF_bazowy!#REF!","v":{"$error":"#REF!"}},{"$f":"+Zał.1_WPF_bazowy!#REF!","v":{"$error":"#REF!"}},{"$f":"+Zał.1_WPF_bazowy!#REF!","v":{"$error":"#REF!"}},{"$f":"+Zał.1_WPF_bazowy!#REF!","v":{"$error":"#REF!"}},{"$f":"+Zał.1_WPF_bazowy!#REF!","v":{"$error":"#REF!"}},{"$f":"+Zał.1_WPF_bazowy!#REF!","v":{"$error":"#REF!"}},{"$f":"+Zał.1_WPF_bazowy!#REF!","v":{"$error":"#REF!"}},{"$f":"+Zał.1_WPF_bazowy!#REF!","v":{"$error":"#REF!"}},{"$f":"+Zał.1_WPF_bazowy!#REF!","v":{"$error":"#REF!"}},{"$f":"+Zał.1_WPF_bazowy!#REF!","v":{"$error":"#REF!"}},{"$f":"+Zał.1_WPF_bazowy!#REF!","v":{"$error":"#REF!"}},{"$f":"+Zał.1_WPF_bazowy!#REF!","v":{"$error":"#REF!"}},{"$f":"+Zał.1_WPF_bazowy!#REF!","v":{"$error":"#REF!"}},{"$f":"+Zał.1_WPF_bazowy!#REF!","v":{"$error":"#REF!"}},{"$f":"+Zał.1_WPF_bazowy!#REF!","v":{"$error":"#REF!"}},{"$f":"+Zał.1_WPF_bazowy!#REF!","v":{"$error":"#REF!"}},{"$f":"+Zał.1_WPF_bazowy!#REF!","v":{"$error":"#REF!"}},{"$f":"+Zał.1_WPF_bazowy!#REF!","v":{"$error":"#REF!"}},{"$f":"+Zał.1_WPF_bazowy!#REF!","v":{"$error":"#REF!"}},{"$f":"+Zał.1_WPF_bazowy!#REF!","v":{"$error":"#REF!"}},{"$f":"+Zał.1_WPF_bazowy!#REF!","v":{"$error":"#REF!"}},{"$f":"+Zał.1_WPF_bazowy!#REF!","v":{"$error":"#REF!"}},{"$f":"+Zał.1_WPF_bazowy!#REF!","v":{"$error":"#REF!"}}]
["x","14.3.1",null,"spłata zobowiązań wymagalnych z lat poprzednich, innych niż w pkt 14.3.3",{"$f":"Zał.1_WPF_bazowy!E107","v":0},{"$f":"Zał.1_WPF_bazowy!F107","v":0},{"$f":"Zał.1_WPF_bazowy!G107","v":0},{"$f":"Zał.1_WPF_bazowy!H107","v":0},{"$f":"+Zał.1_WPF_bazowy!I107","v":0},{"$f":"+Zał.1_WPF_bazowy!J107","v":0},{"$f":"+Zał.1_WPF_bazowy!K107","v":0},{"$f":"+Zał.1_WPF_bazowy!L107","v":0},{"$f":"+Zał.1_WPF_bazowy!#REF!","v":{"$error":"#REF!"}},{"$f":"+Zał.1_WPF_bazowy!#REF!","v":{"$error":"#REF!"}},{"$f":"+Zał.1_WPF_bazowy!#REF!","v":{"$error":"#REF!"}},{"$f":"+Zał.1_WPF_bazowy!#REF!","v":{"$error":"#REF!"}},{"$f":"+Zał.1_WPF_bazowy!#REF!","v":{"$error":"#REF!"}},{"$f":"+Zał.1_WPF_bazowy!#REF!","v":{"$error":"#REF!"}},{"$f":"+Zał.1_WPF_bazowy!#REF!","v":{"$error":"#REF!"}},{"$f":"+Zał.1_WPF_bazowy!#REF!","v":{"$error":"#REF!"}},{"$f":"+Zał.1_WPF_bazowy!#REF!","v":{"$error":"#REF!"}},{"$f":"+Zał.1_WPF_bazowy!#REF!","v":{"$error":"#REF!"}},{"$f":"+Zał.1_WPF_bazowy!#REF!","v":{"$error":"#REF!"}},{"$f":"+Zał.1_WPF_bazowy!#REF!","v":{"$error":"#REF!"}},{"$f":"+Zał.1_WPF_bazowy!#REF!","v":{"$error":"#REF!"}},{"$f":"+Zał.1_WPF_bazowy!#REF!","v":{"$error":"#REF!"}},{"$f":"+Zał.1_WPF_bazowy!#REF!","v":{"$error":"#REF!"}},{"$f":"+Zał.1_WPF_bazowy!#REF!","v":{"$error":"#REF!"}},{"$f":"+Zał.1_WPF_bazowy!#REF!","v":{"$error":"#REF!"}},{"$f":"+Zał.1_WPF_bazowy!#REF!","v":{"$error":"#REF!"}},{"$f":"+Zał.1_WPF_bazowy!#REF!","v":{"$error":"#REF!"}},{"$f":"+Zał.1_WPF_bazowy!#REF!","v":{"$error":"#REF!"}},{"$f":"+Zał.1_WPF_bazowy!#REF!","v":{"$error":"#REF!"}},{"$f":"+Zał.1_WPF_bazowy!#REF!","v":{"$error":"#REF!"}},{"$f":"+Zał.1_WPF_bazowy!#REF!","v":{"$error":"#REF!"}},{"$f":"+Zał.1_WPF_bazowy!#REF!","v":{"$error":"#REF!"}},{"$f":"+Zał.1_WPF_bazowy!#REF!","v":{"$error":"#REF!"}},{"$f":"+Zał.1_WPF_bazowy!#REF!","v":{"$error":"#REF!"}}]
["x","14.3.2",null,"związane z umowami zaliczanymi do tytułów dłużnych wliczanych do państwowego długu publicznego",{"$f":"Zał.1_WPF_bazowy!E108","v":0},{"$f":"Zał.1_WPF_bazowy!F108","v":0},{"$f":"Zał.1_WPF_bazowy!G108","v":0},{"$f":"Zał.1_WPF_bazowy!H108","v":0},{"$f":"+Zał.1_WPF_bazowy!I108","v":0},{"$f":"+Zał.1_WPF_bazowy!J108","v":0},{"$f":"+Zał.1_WPF_bazowy!K108","v":0},{"$f":"+Zał.1_WPF_bazowy!L108","v":0},{"$f":"+Zał.1_WPF_bazowy!#REF!","v":{"$error":"#REF!"}},{"$f":"+Zał.1_WPF_bazowy!#REF!","v":{"$error":"#REF!"}},{"$f":"+Zał.1_WPF_bazowy!#REF!","v":{"$error":"#REF!"}},{"$f":"+Zał.1_WPF_bazowy!#REF!","v":{"$error":"#REF!"}},{"$f":"+Zał.1_WPF_bazowy!#REF!","v":{"$error":"#REF!"}},{"$f":"+Zał.1_WPF_bazowy!#REF!","v":{"$error":"#REF!"}},{"$f":"+Zał.1_WPF_bazowy!#REF!","v":{"$error":"#REF!"}},{"$f":"+Zał.1_WPF_bazowy!#REF!","v":{"$error":"#REF!"}},{"$f":"+Zał.1_WPF_bazowy!#REF!","v":{"$error":"#REF!"}},{"$f":"+Zał.1_WPF_bazowy!#REF!","v":{"$error":"#REF!"}},{"$f":"+Zał.1_WPF_bazowy!#REF!","v":{"$error":"#REF!"}},{"$f":"+Zał.1_WPF_bazowy!#REF!","v":{"$error":"#REF!"}},{"$f":"+Zał.1_WPF_bazowy!#REF!","v":{"$error":"#REF!"}},{"$f":"+Zał.1_WPF_bazowy!#REF!","v":{"$error":"#REF!"}},{"$f":"+Zał.1_WPF_bazowy!#REF!","v":{"$error":"#REF!"}},{"$f":"+Zał.1_WPF_bazowy!#REF!","v":{"$error":"#REF!"}},{"$f":"+Zał.1_WPF_bazowy!#REF!","v":{"$error":"#REF!"}},{"$f":"+Zał.1_WPF_bazowy!#REF!","v":{"$error":"#REF!"}},{"$f":"+Zał.1_WPF_bazowy!#REF!","v":{"$error":"#REF!"}},{"$f":"+Zał.1_WPF_bazowy!#REF!","v":{"$error":"#REF!"}},{"$f":"+Zał.1_WPF_bazowy!#REF!","v":{"$error":"#REF!"}},{"$f":"+Zał.1_WPF_bazowy!#REF!","v":{"$error":"#REF!"}},{"$f":"+Zał.1_WPF_bazowy!#REF!","v":{"$error":"#REF!"}},{"$f":"+Zał.1_WPF_bazowy!#REF!","v":{"$error":"#REF!"}},{"$f":"+Zał.1_WPF_bazowy!#REF!","v":{"$error":"#REF!"}},{"$f":"+Zał.1_WPF_bazowy!#REF!","v":{"$error":"#REF!"}}]
["x","14.3.3",null,"wypłaty z tytułu wymagalnych poręczeń i gwarancji",{"$f":"Zał.1_WPF_bazowy!E109","v":0},{"$f":"Zał.1_WPF_bazowy!F109","v":0},{"$f":"Zał.1_WPF_bazowy!G109","v":0},{"$f":"Zał.1_WPF_bazowy!H109","v":0},{"$f":"+Zał.1_WPF_bazowy!I109","v":0},{"$f":"+Zał.1_WPF_bazowy!J109","v":0},{"$f":"+Zał.1_WPF_bazowy!K109","v":0},{"$f":"+Zał.1_WPF_bazowy!L109","v":0},{"$f":"+Zał.1_WPF_bazowy!#REF!","v":{"$error":"#REF!"}},{"$f":"+Zał.1_WPF_bazowy!#REF!","v":{"$error":"#REF!"}},{"$f":"+Zał.1_WPF_bazowy!#REF!","v":{"$error":"#REF!"}},{"$f":"+Zał.1_WPF_bazowy!#REF!","v":{"$error":"#REF!"}},{"$f":"+Zał.1_WPF_bazowy!#REF!","v":{"$error":"#REF!"}},{"$f":"+Zał.1_WPF_bazowy!#REF!","v":{"$error":"#REF!"}},{"$f":"+Zał.1_WPF_bazowy!#REF!","v":{"$error":"#REF!"}},{"$f":"+Zał.1_WPF_bazowy!#REF!","v":{"$error":"#REF!"}},{"$f":"+Zał.1_WPF_bazowy!#REF!","v":{"$error":"#REF!"}},{"$f":"+Zał.1_WPF_bazowy!#REF!","v":{"$error":"#REF!"}},{"$f":"+Zał.1_WPF_bazowy!#REF!","v":{"$error":"#REF!"}},{"$f":"+Zał.1_WPF_bazowy!#REF!","v":{"$error":"#REF!"}},{"$f":"+Zał.1_WPF_bazowy!#REF!","v":{"$error":"#REF!"}},{"$f":"+Zał.1_WPF_bazowy!#REF!","v":{"$error":"#REF!"}},{"$f":"+Zał.1_WPF_bazowy!#REF!","v":{"$error":"#REF!"}},{"$f":"+Zał.1_WPF_bazowy!#REF!","v":{"$error":"#REF!"}},{"$f":"+Zał.1_WPF_bazowy!#REF!","v":{"$error":"#REF!"}},{"$f":"+Zał.1_WPF_bazowy!#REF!","v":{"$error":"#REF!"}},{"$f":"+Zał.1_WPF_bazowy!#REF!","v":{"$error":"#REF!"}},{"$f":"+Zał.1_WPF_bazowy!#REF!","v":{"$error":"#REF!"}},{"$f":"+Zał.1_WPF_bazowy!#REF!","v":{"$error":"#REF!"}},{"$f":"+Zał.1_WPF_bazowy!#REF!","v":{"$error":"#REF!"}},{"$f":"+Zał.1_WPF_bazowy!#REF!","v":{"$error":"#REF!"}},{"$f":"+Zał.1_WPF_bazowy!#REF!","v":{"$error":"#REF!"}},{"$f":"+Zał.1_WPF_bazowy!#REF!","v":{"$error":"#REF!"}},{"$f":"+Zał.1_WPF_bazowy!#REF!","v":{"$error":"#REF!"}}]
["x","14.4",null,"Wynik operacji niekasowych wpływających na kwotę długu ( m.in. umorzenia, różnice kursowe)",{"$f":"Zał.1_WPF_bazowy!E110","v":0},{"$f":"Zał.1_WPF_bazowy!F110","v":0},{"$f":"Zał.1_WPF_bazowy!G110","v":0},{"$f":"Zał.1_WPF_bazowy!H110","v":0},{"$f":"+Zał.1_WPF_bazowy!I110","v":0},{"$f":"+Zał.1_WPF_bazowy!J110","v":0},{"$f":"+Zał.1_WPF_bazowy!K110","v":0},{"$f":"+Zał.1_WPF_bazowy!L110","v":0},{"$f":"+Zał.1_WPF_bazowy!#REF!","v":{"$error":"#REF!"}},{"$f":"+Zał.1_WPF_bazowy!#REF!","v":{"$error":"#REF!"}},{"$f":"+Zał.1_WPF_bazowy!#REF!","v":{"$error":"#REF!"}},{"$f":"+Zał.1_WPF_bazowy!#REF!","v":{"$error":"#REF!"}},{"$f":"+Zał.1_WPF_bazowy!#REF!","v":{"$error":"#REF!"}},{"$f":"+Zał.1_WPF_bazowy!#REF!","v":{"$error":"#REF!"}},{"$f":"+Zał.1_WPF_bazowy!#REF!","v":{"$error":"#REF!"}},{"$f":"+Zał.1_WPF_bazowy!#REF!","v":{"$error":"#REF!"}},{"$f":"+Zał.1_WPF_bazowy!#REF!","v":{"$error":"#REF!"}},{"$f":"+Zał.1_WPF_bazowy!#REF!","v":{"$error":"#REF!"}},{"$f":"+Zał.1_WPF_bazowy!#REF!","v":{"$error":"#REF!"}},{"$f":"+Zał.1_WPF_bazowy!#REF!","v":{"$error":"#REF!"}},{"$f":"+Zał.1_WPF_bazowy!#REF!","v":{"$error":"#REF!"}},{"$f":"+Zał.1_WPF_bazowy!#REF!","v":{"$error":"#REF!"}},{"$f":"+Zał.1_WPF_bazowy!#REF!","v":{"$error":"#REF!"}},{"$f":"+Zał.1_WPF_bazowy!#REF!","v":{"$error":"#REF!"}},{"$f":"+Zał.1_WPF_bazowy!#REF!","v":{"$error":"#REF!"}},{"$f":"+Zał.1_WPF_bazowy!#REF!","v":{"$error":"#REF!"}},{"$f":"+Zał.1_WPF_bazowy!#REF!","v":{"$error":"#REF!"}},{"$f":"+Zał.1_WPF_bazowy!#REF!","v":{"$error":"#REF!"}},{"$f":"+Zał.1_WPF_bazowy!#REF!","v":{"$error":"#REF!"}},{"$f":"+Zał.1_WPF_bazowy!#REF!","v":{"$error":"#REF!"}},{"$f":"+Zał.1_WPF_bazowy!#REF!","v":{"$error":"#REF!"}},{"$f":"+Zał.1_WPF_bazowy!#REF!","v":{"$error":"#REF!"}},{"$f":"+Zał.1_WPF_bazowy!#REF!","v":{"$error":"#REF!"}},{"$f":"+Zał.1_WPF_bazowy!#REF!","v":{"$error":"#REF!"}}]
[null,15,null,"Dane dotyczące emitowanych obligacji przychodowych","x","x","x","x","x","x","x","x","x","x","x","x","x","x","x","x","x","x","x","x","x","x","x","x","x","x","x","x","x","x","x","x","x","x"]
[null,"15.1",null,"Środki z przedsięwzięcia gromadzone na rachunku bankowym,  w tym:",{"$f":"Zał.1_WPF_bazowy!E112","v":0},{"$f":"Zał.1_WPF_bazowy!F112","v":0},{"$f":"Zał.1_WPF_bazowy!G112","v":0},{"$f":"Zał.1_WPF_bazowy!H112","v":0},{"$f":"+Zał.1_WPF_bazowy!I112","v":0},{"$f":"+Zał.1_WPF_bazowy!J112","v":0},{"$f":"+Zał.1_WPF_bazowy!K112","v":0},{"$f":"+Zał.1_WPF_bazowy!L112","v":0},{"$f":"+Zał.1_WPF_bazowy!#REF!","v":{"$error":"#REF!"}},{"$f":"+Zał.1_WPF_bazowy!#REF!","v":{"$error":"#REF!"}},{"$f":"+Zał.1_WPF_bazowy!#REF!","v":{"$error":"#REF!"}},{"$f":"+Zał.1_WPF_bazowy!#REF!","v":{"$error":"#REF!"}},{"$f":"+Zał.1_WPF_bazowy!#REF!","v":{"$error":"#REF!"}},{"$f":"+Zał.1_WPF_bazowy!#REF!","v":{"$error":"#REF!"}},{"$f":"+Zał.1_WPF_bazowy!#REF!","v":{"$error":"#REF!"}},{"$f":"+Zał.1_WPF_bazowy!#REF!","v":{"$error":"#REF!"}},{"$f":"+Zał.1_WPF_bazowy!#REF!","v":{"$error":"#REF!"}},{"$f":"+Zał.1_WPF_bazowy!#REF!","v":{"$error":"#REF!"}},{"$f":"+Zał.1_WPF_bazowy!#REF!","v":{"$error":"#REF!"}},{"$f":"+Zał.1_WPF_bazowy!#REF!","v":{"$error":"#REF!"}},{"$f":"+Zał.1_WPF_bazowy!#REF!","v":{"$error":"#REF!"}},{"$f":"+Zał.1_WPF_bazowy!#REF!","v":{"$error":"#REF!"}},{"$f":"+Zał.1_WPF_bazowy!#REF!","v":{"$error":"#REF!"}},{"$f":"+Zał.1_WPF_bazowy!#REF!","v":{"$error":"#REF!"}},{"$f":"+Zał.1_WPF_bazowy!#REF!","v":{"$error":"#REF!"}},{"$f":"+Zał.1_WPF_bazowy!#REF!","v":{"$error":"#REF!"}},{"$f":"+Zał.1_WPF_bazowy!#REF!","v":{"$error":"#REF!"}},{"$f":"+Zał.1_WPF_bazowy!#REF!","v":{"$error":"#REF!"}},{"$f":"+Zał.1_WPF_bazowy!#REF!","v":{"$error":"#REF!"}},{"$f":"+Zał.1_WPF_bazowy!#REF!","v":{"$error":"#REF!"}},{"$f":"+Zał.1_WPF_bazowy!#REF!","v":{"$error":"#REF!"}},{"$f":"+Zał.1_WPF_bazowy!#REF!","v":{"$error":"#REF!"}},{"$f":"+Zał.1_WPF_bazowy!#REF!","v":{"$error":"#REF!"}},{"$f":"+Zał.1_WPF_bazowy!#REF!","v":{"$error":"#REF!"}}]
["x","15.1.1",null,"środki na zaspokojenie roszczeń obligatariuszy",{"$f":"Zał.1_WPF_bazowy!E113","v":0},{"$f":"Zał.1_WPF_bazowy!F113","v":0},{"$f":"Zał.1_WPF_bazowy!G113","v":0},{"$f":"Zał.1_WPF_bazowy!H113","v":0},{"$f":"+Zał.1_WPF_bazowy!I113","v":0},{"$f":"+Zał.1_WPF_bazowy!J113","v":0},{"$f":"+Zał.1_WPF_bazowy!K113","v":0},{"$f":"+Zał.1_WPF_bazowy!L113","v":0},{"$f":"+Zał.1_WPF_bazowy!#REF!","v":{"$error":"#REF!"}},{"$f":"+Zał.1_WPF_bazowy!#REF!","v":{"$error":"#REF!"}},{"$f":"+Zał.1_WPF_bazowy!#REF!","v":{"$error":"#REF!"}},{"$f":"+Zał.1_WPF_bazowy!#REF!","v":{"$error":"#REF!"}},{"$f":"+Zał.1_WPF_bazowy!#REF!","v":{"$error":"#REF!"}},{"$f":"+Zał.1_WPF_bazowy!#REF!","v":{"$error":"#REF!"}},{"$f":"+Zał.1_WPF_bazowy!#REF!","v":{"$error":"#REF!"}},{"$f":"+Zał.1_WPF_bazowy!#REF!","v":{"$error":"#REF!"}},{"$f":"+Zał.1_WPF_bazowy!#REF!","v":{"$error":"#REF!"}},{"$f":"+Zał.1_WPF_bazowy!#REF!","v":{"$error":"#REF!"}},{"$f":"+Zał.1_WPF_bazowy!#REF!","v":{"$error":"#REF!"}},{"$f":"+Zał.1_WPF_bazowy!#REF!","v":{"$error":"#REF!"}},{"$f":"+Zał.1_WPF_bazowy!#REF!","v":{"$error":"#REF!"}},{"$f":"+Zał.1_WPF_bazowy!#REF!","v":{"$error":"#REF!"}},{"$f":"+Zał.1_WPF_bazowy!#REF!","v":{"$error":"#REF!"}},{"$f":"+Zał.1_WPF_bazowy!#REF!","v":{"$error":"#REF!"}},{"$f":"+Zał.1_WPF_bazowy!#REF!","v":{"$error":"#REF!"}},{"$f":"+Zał.1_WPF_bazowy!#REF!","v":{"$error":"#REF!"}},{"$f":"+Zał.1_WPF_bazowy!#REF!","v":{"$error":"#REF!"}},{"$f":"+Zał.1_WPF_bazowy!#REF!","v":{"$error":"#REF!"}},{"$f":"+Zał.1_WPF_bazowy!#REF!","v":{"$error":"#REF!"}},{"$f":"+Zał.1_WPF_bazowy!#REF!","v":{"$error":"#REF!"}},{"$f":"+Zał.1_WPF_bazowy!#REF!","v":{"$error":"#REF!"}},{"$f":"+Zał.1_WPF_bazowy!#REF!","v":{"$error":"#REF!"}},{"$f":"+Zał.1_WPF_bazowy!#REF!","v":{"$error":"#REF!"}},{"$f":"+Zał.1_WPF_bazowy!#REF!","v":{"$error":"#REF!"}}]
["x","15.2",null,"Wydatki bieżące z tytułu świadczenia emitenta należnego obligatariuszom,  nieuwzględniane  w limicie spłaty zobowiązań, o którym mowa w art. 243 ustawy",{"$f":"Zał.1_WPF_bazowy!E114","v":0},{"$f":"Zał.1_WPF_bazowy!F114","v":0},{"$f":"Zał.1_WPF_bazowy!G114","v":0},{"$f":"Zał.1_WPF_bazowy!H114","v":0},{"$f":"+Zał.1_WPF_bazowy!I114","v":0},{"$f":"+Zał.1_WPF_bazowy!J114","v":0},{"$f":"+Zał.1_WPF_bazowy!K114","v":0},{"$f":"+Zał.1_WPF_bazowy!L114","v":0},{"$f":"+Zał.1_WPF_bazowy!#REF!","v":{"$error":"#REF!"}},{"$f":"+Zał.1_WPF_bazowy!#REF!","v":{"$error":"#REF!"}},{"$f":"+Zał.1_WPF_bazowy!#REF!","v":{"$error":"#REF!"}},{"$f":"+Zał.1_WPF_bazowy!#REF!","v":{"$error":"#REF!"}},{"$f":"+Zał.1_WPF_bazowy!#REF!","v":{"$error":"#REF!"}},{"$f":"+Zał.1_WPF_bazowy!#REF!","v":{"$error":"#REF!"}},{"$f":"+Zał.1_WPF_bazowy!#REF!","v":{"$error":"#REF!"}},{"$f":"+Zał.1_WPF_bazowy!#REF!","v":{"$error":"#REF!"}},{"$f":"+Zał.1_WPF_bazowy!#REF!","v":{"$error":"#REF!"}},{"$f":"+Zał.1_WPF_bazowy!#REF!","v":{"$error":"#REF!"}},{"$f":"+Zał.1_WPF_bazowy!#REF!","v":{"$error":"#REF!"}},{"$f":"+Zał.1_WPF_bazowy!#REF!","v":{"$error":"#REF!"}},{"$f":"+Zał.1_WPF_bazowy!#REF!","v":{"$error":"#REF!"}},{"$f":"+Zał.1_WPF_bazowy!#REF!","v":{"$error":"#REF!"}},{"$f":"+Zał.1_WPF_bazowy!#REF!","v":{"$error":"#REF!"}},{"$f":"+Zał.1_WPF_bazowy!#REF!","v":{"$error":"#REF!"}},{"$f":"+Zał.1_WPF_bazowy!#REF!","v":{"$error":"#REF!"}},{"$f":"+Zał.1_WPF_bazowy!#REF!","v":{"$error":"#REF!"}},{"$f":"+Zał.1_WPF_bazowy!#REF!","v":{"$error":"#REF!"}},{"$f":"+Zał.1_WPF_bazowy!#REF!","v":{"$error":"#REF!"}},{"$f":"+Zał.1_WPF_bazowy!#REF!","v":{"$error":"#REF!"}},{"$f":"+Zał.1_WPF_bazowy!#REF!","v":{"$error":"#REF!"}},{"$f":"+Zał.1_WPF_bazowy!#REF!","v":{"$error":"#REF!"}},{"$f":"+Zał.1_WPF_bazowy!#REF!","v":{"$error":"#REF!"}},{"$f":"+Zał.1_WPF_bazowy!#REF!","v":{"$error":"#REF!"}},{"$f":"+Zał.1_WPF_bazowy!#REF!","v":{"$error":"#REF!"}}]
[null,16,null,"Stopień niezachowania relacji określonych w art. 242-244 ustawy \n(dotyczy tylko JST objętych procedurą z art. 240a lub 240b)","x","x","x","x","x","x","x","x","x","x","x","x","x","x","x","x","x","x","x","x","x","x","x","x","x","x","x","x","x","x","x","x","x","x"]
[null,"16.1",null,"Stopień niezachowania relacji zrównoważenia wydatków bieżących, o której mowa w poz. 8.2","x","x","x","x",{"$f":"+IF(I52<0,I52,\"\")","v":""},{"$f":"+IF(J52<0,J52,\"\")","v":""},"","",{"$error":"#REF!"},{"$error":"#REF!"},{"$error":"#REF!"},{"$error":"#REF!"},{"$error":"#REF!"},{"$error":"#REF!"},{"$error":"#REF!"},{"$error":"#REF!"},{"$error":"#REF!"},{"$error":"#REF!"},{"$error":"#REF!"},{"$error":"#REF!"},{"$error":"#REF!"},{"$error":"#REF!"},{"$error":"#REF!"},{"$error":"#REF!"},{"$error":"#REF!"},{"$error":"#REF!"},{"$error":"#REF!"},{"$error":"#REF!"},{"$error":"#REF!"},{"$error":"#REF!"},{"$error":"#REF!"},{"$error":"#REF!"},{"$error":"#REF!"},{"$error":"#REF!"}]
["x","16.2",null,"Stopień niezachowania wskaźnika spłaty zobowiązań, o którym mowa w poz. 9.7","x","x","x","x",{"$f":"IF(I57<=I59,\"\",I59- I57)","v":""},{"$f":"IF(J57<=J59,\"\",J59- J57)","v":""},"","",{"$error":"#REF!"},{"$error":"#REF!"},{"$error":"#REF!"},{"$error":"#REF!"},{"$error":"#REF!"},{"$error":"#REF!"},{"$error":"#REF!"},{"$error":"#REF!"},{"$error":"#REF!"},{"$error":"#REF!"},{"$error":"#REF!"},{"$error":"#REF!"},{"$error":"#REF!"},{"$error":"#REF!"},{"$error":"#REF!"},{"$error":"#REF!"},{"$error":"#REF!"},{"$error":"#REF!"},{"$error":"#REF!"},{"$error":"#REF!"},{"$error":"#REF!"},{"$error":"#REF!"},{"$error":"#REF!"},{"$error":"#REF!"},{"$error":"#REF!"},{"$error":"#REF!"}]
["x","16.3",null,"Stopień niezachowania wskaźnika spłaty zobowiązań, o którym mowa w poz. 9.7.1","x","x","x","x",{"$f":"IF(I57<=I60,\"\",I60-I57)","v":""},{"$f":"IF(J57<=J60,\"\",J60-J57)","v":""},"","",{"$error":"#REF!"},{"$error":"#REF!"},{"$error":"#REF!"},{"$error":"#REF!"},{"$error":"#REF!"},{"$error":"#REF!"},{"$error":"#REF!"},{"$error":"#REF!"},{"$error":"#REF!"},{"$error":"#REF!"},{"$error":"#REF!"},{"$error":"#REF!"},{"$error":"#REF!"},{"$error":"#REF!"},{"$error":"#REF!"},{"$error":"#REF!"},{"$error":"#REF!"},{"$error":"#REF!"},{"$error":"#REF!"},{"$error":"#REF!"},{"$error":"#REF!"},{"$error":"#REF!"},{"$error":"#REF!"},{"$error":"#REF!"},{"$error":"#REF!"},{"$error":"#REF!"}]
[]
[]
[]
[]
[]
[null,"Weryfikacja wybranych danych wykazanych w tabeli Wieloletnia Prognoza Finansowa"]
[null,null,null,"Reguła formalna"]
[null,null,null,"Reguła rachunkowa"]
[null,null,null,"Reguła logiczna"]
[null,null,null,"Reguły kontrolne"]
[null,null,"[1.1] + [4.1] + [4.2] >= ([2.1] - [2.1.2])","Spełnienie wskaźnika z art. 242","x","x","x","x",{"$f":"IF(ROUND(I11+I33+I35,2)>=ROUND(I22-I25,2),\"TAK\",\"NIE\")","v":"TAK"},"TAK","TAK","TAK",{"$error":"#REF!"},{"$error":"#REF!"},{"$error":"#REF!"},{"$error":"#REF!"},{"$error":"#REF!"},{"$error":"#REF!"},{"$error":"#REF!"},{"$error":"#REF!"},{"$error":"#REF!"},{"$error":"#REF!"},{"$error":"#REF!"},{"$error":"#REF!"},{"$error":"#REF!"},{"$error":"#REF!"},{"$error":"#REF!"},{"$error":"#REF!"},{"$error":"#REF!"},{"$error":"#REF!"},{"$error":"#REF!"},{"$error":"#REF!"},{"$error":"#REF!"},{"$error":"#REF!"},{"$error":"#REF!"},{"$error":"#REF!"},{"$error":"#REF!"},{"$error":"#REF!"}]
[null,null,"[13.3] = 0 (dla lat 2014 i wyższych)","Umorzenie zobowiązań, o którym mowa w art. 190 ustawy o działalności leczniczej nie wykracza poza ustawowy okres","x","x","x","x","x","x",{"$f":"IF(K98=0,\"TAK\",\"BŁĄD\")","v":"TAK"},"TAK",{"$error":"#REF!"},{"$error":"#REF!"},{"$error":"#REF!"},{"$error":"#REF!"},{"$error":"#REF!"},{"$error":"#REF!"},{"$error":"#REF!"},{"$error":"#REF!"},{"$error":"#REF!"},{"$error":"#REF!"},{"$error":"#REF!"},{"$error":"#REF!"},{"$error":"#REF!"},{"$error":"#REF!"},{"$error":"#REF!"},{"$error":"#REF!"},{"$error":"#REF!"},{"$error":"#REF!"},{"$error":"#REF!"},{"$error":"#REF!"},{"$error":"#REF!"},{"$error":"#REF!"},{"$error":"#REF!"},{"$error":"#REF!"},{"$error":"#REF!"},{"$error":"#REF!"}]
[null,null,"[1] + [4] - [2] - [5] = 0","Kontrola poprawności zbilansowania budżetu","x","x","x","x",{"$f":"IF(ROUND(I10+I32-I21-I41,2)=0,\"OK\",ROUND(I10+I32-I21-I41,2))","v":"OK"},"OK","OK","OK",{"$error":"#REF!"},{"$error":"#REF!"},{"$error":"#REF!"},{"$error":"#REF!"},{"$error":"#REF!"},{"$error":"#REF!"},{"$error":"#REF!"},{"$error":"#REF!"},{"$error":"#REF!"},{"$error":"#REF!"},{"$error":"#REF!"},{"$error":"#REF!"},{"$error":"#REF!"},{"$error":"#REF!"},{"$error":"#REF!"},{"$error":"#REF!"},{"$error":"#REF!"},{"$error":"#REF!"},{"$error":"#REF!"},{"$error":"#REF!"},{"$error":"#REF!"},{"$error":"#REF!"},{"$error":"#REF!"},{"$error":"#REF!"},{"$error":"#REF!"},{"$error":"#REF!"}]
[null,null,"[6]\"n\" = [6]\"n-1\" + [4.3]\"n\" - [5.1]\"n\" +  ([14.2]\"n\"-[14.2]\"n-1\") + [14.4]","Kontrola poprawności wyliczenia kwoty długu","x","x","x","x",{"$f":"+IF(ROUND(H48+I37-I42+(I105-H105)+I110-I48,2)=0,\"OK\",ROUND(H48+I37-I42+(I105-H105)+I110-I48,2))","v":"OK"},"OK","OK","OK",{"$error":"#REF!"},{"$error":"#REF!"},{"$error":"#REF!"},{"$error":"#REF!"},{"$error":"#REF!"},{"$error":"#REF!"},{"$error":"#REF!"},{"$error":"#REF!"},{"$error":"#REF!"},{"$error":"#REF!"},{"$error":"#REF!"},{"$error":"#REF!"},{"$error":"#REF!"},{"$error":"#REF!"},{"$error":"#REF!"},{"$error":"#REF!"},{"$error":"#REF!"},{"$error":"#REF!"},{"$error":"#REF!"},{"$error":"#REF!"},{"$error":"#REF!"},{"$error":"#REF!"},{"$error":"#REF!"},{"$error":"#REF!"},{"$error":"#REF!"},{"$error":"#REF!"}]
[null,null,"[14.2] \"n\" =  ( [14.2]  \"n-1\" -  [14.3] \"n\" ) ","Analiza zmiany kwoty długu spłacanego wydatkami budżetu \n- wartości różne od zera wymagają objaśnienia \n   - wartości większe od zera wskazują na powstanie w roku prognozy nowego długu tego typu\n   - wartości mniejsze od zera co do zasady nie powinny wystąpić","x","x","x","x",{"$f":"+IF(H105=0,\"N/D\",IF(ROUND(I105+I106-H105,2)=0,\"OK\",ROUND(I105+I106-H105,2)))","v":"N/D"},"N/D","N/D","N/D","N/D",{"$error":"#REF!"},{"$error":"#REF!"},{"$error":"#REF!"},{"$error":"#REF!"},{"$error":"#REF!"},{"$error":"#REF!"},{"$error":"#REF!"},{"$error":"#REF!"},{"$error":"#REF!"},{"$error":"#REF!"},{"$error":"#REF!"},{"$error":"#REF!"},{"$error":"#REF!"},{"$error":"#REF!"},{"$error":"#REF!"},{"$error":"#REF!"},{"$error":"#REF!"},{"$error":"#REF!"},{"$error":"#REF!"},{"$error":"#REF!"},{"$error":"#REF!"},{"$error":"#REF!"},{"$error":"#REF!"},{"$error":"#REF!"},{"$error":"#REF!"}]
[null,null,"[13.1] \"n\"  -  ( [13.3] + [13.4] + [13.5] + [13.6] ) \"n\"  =  [13.1] \"n-1\"","Porównanie na koniec roku prognozy stanu zobowiązań przejętych przez jst po likwidowanych i przekształcanych SP ZOZ z wydatkami i umorzeniami poniesionymi na ten cel ze stanem zobowiązań z okresu N-1","x","x","x","x",{"$f":"+IF(H96=0,\"N/D\",IF(ROUND(I96+(I98+I99+I100+I101)-H96,2)=0,\"OK\",ROUND(I96+(I98+I99+I100+I101)-H96,2)))","v":"N/D"},"N/D","N/D","N/D","N/D",{"$error":"#REF!"},{"$error":"#REF!"},{"$error":"#REF!"},{"$error":"#REF!"},{"$error":"#REF!"},{"$error":"#REF!"},{"$error":"#REF!"},{"$error":"#REF!"},{"$error":"#REF!"},{"$error":"#REF!"},{"$error":"#REF!"},{"$error":"#REF!"},{"$error":"#REF!"},{"$error":"#REF!"},{"$error":"#REF!"},{"$error":"#REF!"},{"$error":"#REF!"},{"$error":"#REF!"},{"$error":"#REF!"},{"$error":"#REF!"},{"$error":"#REF!"},{"$error":"#REF!"},{"$error":"#REF!"},{"$error":"#REF!"},{"$error":"#REF!"}]
[null,null,"jeśli [3] < 0 to sprawdź czy [4.1.1] + [4.2.1] + [4.3.1] + [4.4.1] + [3] = 0","Kontrola poprawności wykazania źródeł pokrycia deficytu","x","x","x","x",{"$f":"IF(I31<0,IF(ROUND(I34+I36+I38+I40+I31,2)=0,\"OK\",ROUND(I34+I36+I38+I40+I31,2)),\"N/D\")","v":"OK"},"N/D","N/D","N/D",{"$error":"#REF!"},{"$error":"#REF!"},{"$error":"#REF!"},{"$error":"#REF!"},{"$error":"#REF!"},{"$error":"#REF!"},{"$error":"#REF!"},{"$error":"#REF!"},{"$error":"#REF!"},{"$error":"#REF!"},{"$error":"#REF!"},{"$error":"#REF!"},{"$error":"#REF!"},{"$error":"#REF!"},{"$error":"#REF!"},{"$error":"#REF!"},{"$error":"#REF!"},{"$error":"#REF!"},{"$error":"#REF!"},{"$error":"#REF!"},{"$error":"#REF!"},{"$error":"#REF!"},{"$error":"#REF!"},{"$error":"#REF!"},{"$error":"#REF!"},{"$error":"#REF!"}]
[null,null,"jeśli [3] >= 0 to sprawdź czy [4.1.1]=0 i [4.2.1]=0 i [4.3.1]=0 i  [4.4.1] = 0","Kontrola poprawności niewykazania źródeł pokrycia deficytu przy nadwyżce budżetu","x","x","x","x",{"$f":"IF(I31>=0,IF(ROUND(I34+I36+I38+I40,2)=0,\"OK\",ROUND(I34+I36+I38+I40,2)),\"N/D\")","v":"N/D"},"OK","OK","OK",{"$error":"#REF!"},{"$error":"#REF!"},{"$error":"#REF!"},{"$error":"#REF!"},{"$error":"#REF!"},{"$error":"#REF!"},{"$error":"#REF!"},{"$error":"#REF!"},{"$error":"#REF!"},{"$error":"#REF!"},{"$error":"#REF!"},{"$error":"#REF!"},{"$error":"#REF!"},{"$error":"#REF!"},{"$error":"#REF!"},{"$error":"#REF!"},{"$error":"#REF!"},{"$error":"#REF!"},{"$error":"#REF!"},{"$error":"#REF!"},{"$error":"#REF!"},{"$error":"#REF!"},{"$error":"#REF!"},{"$error":"#REF!"},{"$error":"#REF!"},{"$error":"#REF!"}]
[null,null,"[1.1.3] >=  [1.1.3.1]","Reguła logiczna:  [1.1.3] >=  [1.1.3.1]","x","x","x","x",{"$f":"IF(I14>=I15,\"OK\",\"BŁĄD\")","v":"OK"},"OK","OK","OK",{"$error":"#REF!"},{"$error":"#REF!"},{"$error":"#REF!"},{"$error":"#REF!"},{"$error":"#REF!"},{"$error":"#REF!"},{"$error":"#REF!"},{"$error":"#REF!"},{"$error":"#REF!"},{"$error":"#REF!"},{"$error":"#REF!"},{"$error":"#REF!"},{"$error":"#REF!"},{"$error":"#REF!"},{"$error":"#REF!"},{"$error":"#REF!"},{"$error":"#REF!"},{"$error":"#REF!"},{"$error":"#REF!"},{"$error":"#REF!"},{"$error":"#REF!"},{"$error":"#REF!"},{"$error":"#REF!"},{"$error":"#REF!"},{"$error":"#REF!"},{"$error":"#REF!"}]
[null,null,"[1.1.5] >= [13.2]","Reguła logiczna:  [1.1.5] >= [13.2]","x","x","x","x",{"$f":"IF(I17>=I97,\"OK\",\"BŁĄD\")","v":"OK"},"OK","OK","OK",{"$error":"#REF!"},{"$error":"#REF!"},{"$error":"#REF!"},{"$error":"#REF!"},{"$error":"#REF!"},{"$error":"#REF!"},{"$error":"#REF!"},{"$error":"#REF!"},{"$error":"#REF!"},{"$error":"#REF!"},{"$error":"#REF!"},{"$error":"#REF!"},{"$error":"#REF!"},{"$error":"#REF!"},{"$error":"#REF!"},{"$error":"#REF!"},{"$error":"#REF!"},{"$error":"#REF!"},{"$error":"#REF!"},{"$error":"#REF!"},{"$error":"#REF!"},{"$error":"#REF!"},{"$error":"#REF!"},{"$error":"#REF!"},{"$error":"#REF!"},{"$error":"#REF!"}]
[null,null,"[1.1] >=  ([1.1.1] + [1.1.2] + [1.1.3] + [1.1.4] + [1.1.5])","Reguła logiczna:  [1.1] >=  ([1.1.1] + [1.1.2] + [1.1.3] + [1.1.4] + [1.1.5])","x","x","x","x",{"$f":"IF(I11>=I12+I13+I14+I16+I17,\"OK\",\"BŁĄD\")","v":"OK"},"OK","OK","OK",{"$error":"#REF!"},{"$error":"#REF!"},{"$error":"#REF!"},{"$error":"#REF!"},{"$error":"#REF!"},{"$error":"#REF!"},{"$error":"#REF!"},{"$error":"#REF!"},{"$error":"#REF!"},{"$error":"#REF!"},{"$error":"#REF!"},{"$error":"#REF!"},{"$error":"#REF!"},{"$error":"#REF!"},{"$error":"#REF!"},{"$error":"#REF!"},{"$error":"#REF!"},{"$error":"#REF!"},{"$error":"#REF!"},{"$error":"#REF!"},{"$error":"#REF!"},{"$error":"#REF!"},{"$error":"#REF!"},{"$error":"#REF!"},{"$error":"#REF!"},{"$error":"#REF!"}]
[null,null,"[1.1] >= [12.1]","Reguła logiczna:  [1.1] >= [12.1]","x","x","x","x",{"$f":"IF(I11>=I75,\"OK\",\"BŁĄD\")","v":"OK"},"OK","OK","OK",{"$error":"#REF!"},{"$error":"#REF!"},{"$error":"#REF!"},{"$error":"#REF!"},{"$error":"#REF!"},{"$error":"#REF!"},{"$error":"#REF!"},{"$error":"#REF!"},{"$error":"#REF!"},{"$error":"#REF!"},{"$error":"#REF!"},{"$error":"#REF!"},{"$error":"#REF!"},{"$error":"#REF!"},{"$error":"#REF!"},{"$error":"#REF!"},{"$error":"#REF!"},{"$error":"#REF!"},{"$error":"#REF!"},{"$error":"#REF!"},{"$error":"#REF!"},{"$error":"#REF!"},{"$error":"#REF!"},{"$error":"#REF!"},{"$error":"#REF!"},{"$error":"#REF!"}]
[null,null,"[1.2] >= [1.2.1]","Reguła logiczna:  [1.2] >= [1.2.1]","x","x","x","x",{"$f":"IF(I18>=I19,\"OK\",\"BŁĄD\")","v":"OK"},"OK","OK","OK",{"$error":"#REF!"},{"$error":"#REF!"},{"$error":"#REF!"},{"$error":"#REF!"},{"$error":"#REF!"},{"$error":"#REF!"},{"$error":"#REF!"},{"$error":"#REF!"},{"$error":"#REF!"},{"$error":"#REF!"},{"$error":"#REF!"},{"$error":"#REF!"},{"$error":"#REF!"},{"$error":"#REF!"},{"$error":"#REF!"},{"$error":"#REF!"},{"$error":"#REF!"},{"$error":"#REF!"},{"$error":"#REF!"},{"$error":"#REF!"},{"$error":"#REF!"},{"$error":"#REF!"},{"$error":"#REF!"},{"$error":"#REF!"},{"$error":"#REF!"},{"$error":"#REF!"}]
[null,null,"[1.2] >= [1.2.2]","Reguła logiczna:  [1.2] >= [1.2.2]","x","x","x","x",{"$f":"IF(I18>=I20,\"OK\",\"BŁĄD\")","v":"OK"},"OK","OK","OK",{"$error":"#REF!"},{"$error":"#REF!"},{"$error":"#REF!"},{"$error":"#REF!"},{"$error":"#REF!"},{"$error":"#REF!"},{"$error":"#REF!"},{"$error":"#REF!"},{"$error":"#REF!"},{"$error":"#REF!"},{"$error":"#REF!"},{"$error":"#REF!"},{"$error":"#REF!"},{"$error":"#REF!"},{"$error":"#REF!"},{"$error":"#REF!"},{"$error":"#REF!"},{"$error":"#REF!"},{"$error":"#REF!"},{"$error":"#REF!"},{"$error":"#REF!"},{"$error":"#REF!"},{"$error":"#REF!"},{"$error":"#REF!"},{"$error":"#REF!"},{"$error":"#REF!"}]
[null,null,"[1.2] >= [12.2]","Reguła logiczna:  [1.2] >= [12.2]","x","x","x","x",{"$f":"IF(I18>=I78,\"OK\",\"BŁĄD\")","v":"OK"},"OK","OK","OK",{"$error":"#REF!"},{"$error":"#REF!"},{"$error":"#REF!"},{"$error":"#REF!"},{"$error":"#REF!"},{"$error":"#REF!"},{"$error":"#REF!"},{"$error":"#REF!"},{"$error":"#REF!"},{"$error":"#REF!"},{"$error":"#REF!"},{"$error":"#REF!"},{"$error":"#REF!"},{"$error":"#REF!"},{"$error":"#REF!"},{"$error":"#REF!"},{"$error":"#REF!"},{"$error":"#REF!"},{"$error":"#REF!"},{"$error":"#REF!"},{"$error":"#REF!"},{"$error":"#REF!"},{"$error":"#REF!"},{"$error":"#REF!"},{"$error":"#REF!"},{"$error":"#REF!"}]
[null,null,null,"Reguła logiczna: jeżeli [3] >0 to [10] = [3]","x","x","x","x",{"$f":"+IF(I31>0,IF(I31=I63,\"OK\",\"Błąd\"),\"N/D\")","v":"N/D"},"OK","OK","N/D",{"$error":"#REF!"},{"$error":"#REF!"},{"$error":"#REF!"},{"$error":"#REF!"},{"$error":"#REF!"},{"$error":"#REF!"},{"$error":"#REF!"},{"$error":"#REF!"},{"$error":"#REF!"},{"$error":"#REF!"},{"$error":"#REF!"},{"$error":"#REF!"},{"$error":"#REF!"},{"$error":"#REF!"},{"$error":"#REF!"},{"$error":"#REF!"},{"$error":"#REF!"},{"$error":"#REF!"},{"$error":"#REF!"},{"$error":"#REF!"},{"$error":"#REF!"},{"$error":"#REF!"},{"$error":"#REF!"},{"$error":"#REF!"},{"$error":"#REF!"},{"$error":"#REF!"}]
[null,null,"[10] >= [10.1]","Reguła logiczna:  [10] >= [10.1]","x","x","x","x",{"$f":"IF(I63>=I64,\"OK\",\"BŁĄD\")","v":"OK"},"OK","OK","OK",{"$error":"#REF!"},{"$error":"#REF!"},{"$error":"#REF!"},{"$error":"#REF!"},{"$error":"#REF!"},{"$error":"#REF!"},{"$error":"#REF!"},{"$error":"#REF!"},{"$error":"#REF!"},{"$error":"#REF!"},{"$error":"#REF!"},{"$error":"#REF!"},{"$error":"#REF!"},{"$error":"#REF!"},{"$error":"#REF!"},{"$error":"#REF!"},{"$error":"#REF!"},{"$error":"#REF!"},{"$error":"#REF!"},{"$error":"#REF!"},{"$error":"#REF!"},{"$error":"#REF!"},{"$error":"#REF!"},{"$error":"#REF!"},{"$error":"#REF!"},{"$error":"#REF!"}]
[null,null,"jeśli [10] > 0 to powinno być [10.1] > 0","Reguła logiczna:  jeżeli [10] > 0 to [10.1] >0","x","x","x","x",{"$f":"IF(I63>0,IF(I64>0,\"OK\",\"BŁĄD\"),\"N/D\")","v":"N/D"},"OK","OK","N/D",{"$error":"#REF!"},{"$error":"#REF!"},{"$error":"#REF!"},{"$error":"#REF!"},{"$error":"#REF!"},{"$error":"#REF!"},{"$error":"#REF!"},{"$error":"#REF!"},{"$error":"#REF!"},{"$error":"#REF!"},{"$error":"#REF!"},{"$error":"#REF!"},{"$error":"#REF!"},{"$error":"#REF!"},{"$error":"#REF!"},{"$error":"#REF!"},{"$error":"#REF!"},{"$error":"#REF!"},{"$error":"#REF!"},{"$error":"#REF!"},{"$error":"#REF!"},{"$error":"#REF!"},{"$error":"#REF!"},{"$error":"#REF!"},{"$error":"#REF!"},{"$error":"#REF!"}]
[null,null,"[12.1] >= [12.1.1]","Reguła logiczna:  [12.1] >= [12.1.1]","x","x","x","x",{"$f":"IF(I75>=I76,\"OK\",\"BŁĄD\")","v":"OK"},"OK","OK","OK",{"$error":"#REF!"},{"$error":"#REF!"},{"$error":"#REF!"},{"$error":"#REF!"},{"$error":"#REF!"},{"$error":"#REF!"},{"$error":"#REF!"},{"$error":"#REF!"},{"$error":"#REF!"},{"$error":"#REF!"},{"$error":"#REF!"},{"$error":"#REF!"},{"$error":"#REF!"},{"$error":"#REF!"},{"$error":"#REF!"},{"$error":"#REF!"},{"$error":"#REF!"},{"$error":"#REF!"},{"$error":"#REF!"},{"$error":"#REF!"},{"$error":"#REF!"},{"$error":"#REF!"},{"$error":"#REF!"},{"$error":"#REF!"},{"$error":"#REF!"},{"$error":"#REF!"}]
[null,null,"[12.1.1] >= [12.1.1.1]","Reguła logiczna:  [12.1.1] >= [12.1.1.1]","x","x","x","x",{"$f":"IF(I76>=I77,\"OK\",\"BŁĄD\")","v":"OK"},"OK","OK","OK",{"$error":"#REF!"},{"$error":"#REF!"},{"$error":"#REF!"},{"$error":"#REF!"},{"$error":"#REF!"},{"$error":"#REF!"},{"$error":"#REF!"},{"$error":"#REF!"},{"$error":"#REF!"},{"$error":"#REF!"},{"$error":"#REF!"},{"$error":"#REF!"},{"$error":"#REF!"},{"$error":"#REF!"},{"$error":"#REF!"},{"$error":"#REF!"},{"$error":"#REF!"},{"$error":"#REF!"},{"$error":"#REF!"},{"$error":"#REF!"},{"$error":"#REF!"},{"$error":"#REF!"},{"$error":"#REF!"},{"$error":"#REF!"},{"$error":"#REF!"},{"$error":"#REF!"}]
[null,null,"[12.2] >= [12.2.1]","Reguła logiczna:  [12.2] >= [12.2.1]","x","x","x","x",{"$f":"IF(I78>=I79,\"OK\",\"BŁĄD\")","v":"OK"},"OK","OK","OK",{"$error":"#REF!"},{"$error":"#REF!"},{"$error":"#REF!"},{"$error":"#REF!"},{"$error":"#REF!"},{"$error":"#REF!"},{"$error":"#REF!"},{"$error":"#REF!"},{"$error":"#REF!"},{"$error":"#REF!"},{"$error":"#REF!"},{"$error":"#REF!"},{"$error":"#REF!"},{"$error":"#REF!"},{"$error":"#REF!"},{"$error":"#REF!"},{"$error":"#REF!"},{"$error":"#REF!"},{"$error":"#REF!"},{"$error":"#REF!"},{"$error":"#REF!"},{"$error":"#REF!"},{"$error":"#REF!"},{"$error":"#REF!"},{"$error":"#REF!"},{"$error":"#REF!"}]
[null,null,"[12.2.1] >= [12.2.1.1]","Reguła logiczna:  [12.2.1] >= [12.2.1.1]","x","x","x","x",{"$f":"IF(I79>=I80,\"OK\",\"BŁĄD\")","v":"OK"},"OK","OK","OK",{"$error":"#REF!"},{"$error":"#REF!"},{"$error":"#REF!"},{"$error":"#REF!"},{"$error":"#REF!"},{"$error":"#REF!"},{"$error":"#REF!"},{"$error":"#REF!"},{"$error":"#REF!"},{"$error":"#REF!"},{"$error":"#REF!"},{"$error":"#REF!"},{"$error":"#REF!"},{"$error":"#REF!"},{"$error":"#REF!"},{"$error":"#REF!"},{"$error":"#REF!"},{"$error":"#REF!"},{"$error":"#REF!"},{"$error":"#REF!"},{"$error":"#REF!"},{"$error":"#REF!"},{"$error":"#REF!"},{"$error":"#REF!"},{"$error":"#REF!"},{"$error":"#REF!"}]
[null,null,"[12.3] >= [12.3.1]","Reguła logiczna:  [12.3] >= [12.3.1]","x","x","x","x",{"$f":"IF(I81>=I82,\"OK\",\"BŁĄD\")","v":"OK"},"OK","OK","OK",{"$error":"#REF!"},{"$error":"#REF!"},{"$error":"#REF!"},{"$error":"#REF!"},{"$error":"#REF!"},{"$error":"#REF!"},{"$error":"#REF!"},{"$error":"#REF!"},{"$error":"#REF!"},{"$error":"#REF!"},{"$error":"#REF!"},{"$error":"#REF!"},{"$error":"#REF!"},{"$error":"#REF!"},{"$error":"#REF!"},{"$error":"#REF!"},{"$error":"#REF!"},{"$error":"#REF!"},{"$error":"#REF!"},{"$error":"#REF!"},{"$error":"#REF!"},{"$error":"#REF!"},{"$error":"#REF!"},{"$error":"#REF!"},{"$error":"#REF!"},{"$error":"#REF!"}]
[null,null,"[12.3] >= [12.3.2]","Reguła logiczna:  [12.3] >= [12.3.2]","x","x","x","x",{"$f":"IF(I81>=I83,\"OK\",\"BŁĄD\")","v":"OK"},"OK","OK","OK",{"$error":"#REF!"},{"$error":"#REF!"},{"$error":"#REF!"},{"$error":"#REF!"},{"$error":"#REF!"},{"$error":"#REF!"},{"$error":"#REF!"},{"$error":"#REF!"},{"$error":"#REF!"},{"$error":"#REF!"},{"$error":"#REF!"},{"$error":"#REF!"},{"$error":"#REF!"},{"$error":"#REF!"},{"$error":"#REF!"},{"$error":"#REF!"},{"$error":"#REF!"},{"$error":"#REF!"},{"$error":"#REF!"},{"$error":"#REF!"},{"$error":"#REF!"},{"$error":"#REF!"},{"$error":"#REF!"},{"$error":"#REF!"},{"$error":"#REF!"},{"$error":"#REF!"}]
[null,null,"[12.4] >= [12.4.1]","Reguła logiczna:  [12.4] >= [12.4.1]","x","x","x","x",{"$f":"IF(I84>=I85,\"OK\",\"BŁĄD\")","v":"OK"},"OK","OK","OK",{"$error":"#REF!"},{"$error":"#REF!"},{"$error":"#REF!"},{"$error":"#REF!"},{"$error":"#REF!"},{"$error":"#REF!"},{"$error":"#REF!"},{"$error":"#REF!"},{"$error":"#REF!"},{"$error":"#REF!"},{"$error":"#REF!"},{"$error":"#REF!"},{"$error":"#REF!"},{"$error":"#REF!"},{"$error":"#REF!"},{"$error":"#REF!"},{"$error":"#REF!"},{"$error":"#REF!"},{"$error":"#REF!"},{"$error":"#REF!"},{"$error":"#REF!"},{"$error":"#REF!"},{"$error":"#REF!"},{"$error":"#REF!"},{"$error":"#REF!"},{"$error":"#REF!"}]
[null,null,"[12.4] >= [12.4.2]","Reguła logiczna:  [12.4] >= [12.4.2]","x","x","x","x",{"$f":"IF(I84>=I86,\"OK\",\"BŁĄD\")","v":"OK"},"OK","OK","OK",{"$error":"#REF!"},{"$error":"#REF!"},{"$error":"#REF!"},{"$error":"#REF!"},{"$error":"#REF!"},{"$error":"#REF!"},{"$error":"#REF!"},{"$error":"#REF!"},{"$error":"#REF!"},{"$error":"#REF!"},{"$error":"#REF!"},{"$error":"#REF!"},{"$error":"#REF!"},{"$error":"#REF!"},{"$error":"#REF!"},{"$error":"#REF!"},{"$error":"#REF!"},{"$error":"#REF!"},{"$error":"#REF!"},{"$error":"#REF!"},{"$error":"#REF!"},{"$error":"#REF!"},{"$error":"#REF!"},{"$error":"#REF!"},{"$error":"#REF!"},{"$error":"#REF!"}]
[null,null,"[12.4] >= [12.4.1]","Reguła logiczna:  [12.5] >= [12.5.1]","x","x","x","x",{"$f":"IF(I87>=I88,\"OK\",\"BŁĄD\")","v":"OK"},{"$f":"IF(J87>=J88,\"OK\",\"BŁĄD\")","v":"OK"},"OK","OK",{"$error":"#REF!"},{"$error":"#REF!"},{"$error":"#REF!"},{"$error":"#REF!"},{"$error":"#REF!"},{"$error":"#REF!"},{"$error":"#REF!"},{"$error":"#REF!"},{"$error":"#REF!"},{"$error":"#REF!"},{"$error":"#REF!"},{"$error":"#REF!"},{"$error":"#REF!"},{"$error":"#REF!"},{"$error":"#REF!"},{"$error":"#REF!"},{"$error":"#REF!"},{"$error":"#REF!"},{"$error":"#REF!"},{"$error":"#REF!"},{"$error":"#REF!"},{"$error":"#REF!"},{"$error":"#REF!"},{"$error":"#REF!"},{"$error":"#REF!"},{"$error":"#REF!"}]
[null,null,"[12.4] >= [12.4.1]","Reguła logiczna:  [12.6] >= [12.6.1]","x","x","x","x",{"$f":"IF(I89>=I90,\"OK\",\"BŁĄD\")","v":"OK"},{"$f":"IF(J89>=J90,\"OK\",\"BŁĄD\")","v":"OK"},"OK","OK",{"$error":"#REF!"},{"$error":"#REF!"},{"$error":"#REF!"},{"$error":"#REF!"},{"$error":"#REF!"},{"$error":"#REF!"},{"$error":"#REF!"},{"$error":"#REF!"},{"$error":"#REF!"},{"$error":"#REF!"},{"$error":"#REF!"},{"$error":"#REF!"},{"$error":"#REF!"},{"$error":"#REF!"},{"$error":"#REF!"},{"$error":"#REF!"},{"$error":"#REF!"},{"$error":"#REF!"},{"$error":"#REF!"},{"$error":"#REF!"},{"$error":"#REF!"},{"$error":"#REF!"},{"$error":"#REF!"},{"$error":"#REF!"},{"$error":"#REF!"},{"$error":"#REF!"}]
[null,null,"[12.4] >= [12.4.1]","Reguła logiczna:  [12.7] >= [12.7.1]","x","x","x","x",{"$f":"IF(I91>=I92,\"OK\",\"BŁĄD\")","v":"OK"},{"$f":"IF(J91>=J92,\"OK\",\"BŁĄD\")","v":"OK"},"OK","OK",{"$error":"#REF!"},{"$error":"#REF!"},{"$error":"#REF!"},{"$error":"#REF!"},{"$error":"#REF!"},{"$error":"#REF!"},{"$error":"#REF!"},{"$error":"#REF!"},{"$error":"#REF!"},{"$error":"#REF!"},{"$error":"#REF!"},{"$error":"#REF!"},{"$error":"#REF!"},{"$error":"#REF!"},{"$error":"#REF!"},{"$error":"#REF!"},{"$error":"#REF!"},{"$error":"#REF!"},{"$error":"#REF!"},{"$error":"#REF!"},{"$error":"#REF!"},{"$error":"#REF!"},{"$error":"#REF!"},{"$error":"#REF!"},{"$error":"#REF!"},{"$error":"#REF!"}]
[null,null,"[12.4] >= [12.4.1]","Reguła logiczna:  [12.8] >= [12.8.1]","x","x","x","x",{"$f":"IF(I93>=I94,\"OK\",\"BŁĄD\")","v":"OK"},{"$f":"IF(J93>=J94,\"OK\",\"BŁĄD\")","v":"OK"},"OK","OK",{"$error":"#REF!"},{"$error":"#REF!"},{"$error":"#REF!"},{"$error":"#REF!"},{"$error":"#REF!"},{"$error":"#REF!"},{"$error":"#REF!"},{"$error":"#REF!"},{"$error":"#REF!"},{"$error":"#REF!"},{"$error":"#REF!"},{"$error":"#REF!"},{"$error":"#REF!"},{"$error":"#REF!"},{"$error":"#REF!"},{"$error":"#REF!"},{"$error":"#REF!"},{"$error":"#REF!"},{"$error":"#REF!"},{"$error":"#REF!"},{"$error":"#REF!"},{"$error":"#REF!"},{"$error":"#REF!"},{"$error":"#REF!"},{"$error":"#REF!"},{"$error":"#REF!"}]
[null,null,"[13.1] >= [13.3]","Reguła logiczna:  [13.1] >= [13.3]","x","x","x","x",{"$f":"IF(I96>=I98,\"OK\",\"BŁĄD\")","v":"OK"},"OK","OK","OK",{"$error":"#REF!"},{"$error":"#REF!"},{"$error":"#REF!"},{"$error":"#REF!"},{"$error":"#REF!"},{"$error":"#REF!"},{"$error":"#REF!"},{"$error":"#REF!"},{"$error":"#REF!"},{"$error":"#REF!"},{"$error":"#REF!"},{"$error":"#REF!"},{"$error":"#REF!"},{"$error":"#REF!"},{"$error":"#REF!"},{"$error":"#REF!"},{"$error":"#REF!"},{"$error":"#REF!"},{"$error":"#REF!"},{"$error":"#REF!"},{"$error":"#REF!"},{"$error":"#REF!"},{"$error":"#REF!"},{"$error":"#REF!"},{"$error":"#REF!"},{"$error":"#REF!"}]
[null,null,"[13.4] >= [2.1.2]","Reguła logiczna:  [13.4] >= [2.1.2]","x","x","x","x",{"$f":"IF(I99>=I25,\"OK\",\"BŁĄD\")","v":"OK"},"OK","OK","OK",{"$error":"#REF!"},{"$error":"#REF!"},{"$error":"#REF!"},{"$error":"#REF!"},{"$error":"#REF!"},{"$error":"#REF!"},{"$error":"#REF!"},{"$error":"#REF!"},{"$error":"#REF!"},{"$error":"#REF!"},{"$error":"#REF!"},{"$error":"#REF!"},{"$error":"#REF!"},{"$error":"#REF!"},{"$error":"#REF!"},{"$error":"#REF!"},{"$error":"#REF!"},{"$error":"#REF!"},{"$error":"#REF!"},{"$error":"#REF!"},{"$error":"#REF!"},{"$error":"#REF!"},{"$error":"#REF!"},{"$error":"#REF!"},{"$error":"#REF!"},{"$error":"#REF!"}]
[null,null,"[14.3] >= [14.3.1] + [14.3.2] + [14.3.3]","Reguła logiczna:  [14.3] >= [14.3.1] + [14.3.2] + [14.3.3]","x","x","x","x",{"$f":"IF(I106>=(I107+I108+I109),\"OK\",\"BŁĄD\")","v":"OK"},"OK","OK","OK",{"$error":"#REF!"},{"$error":"#REF!"},{"$error":"#REF!"},{"$error":"#REF!"},{"$error":"#REF!"},{"$error":"#REF!"},{"$error":"#REF!"},{"$error":"#REF!"},{"$error":"#REF!"},{"$error":"#REF!"},{"$error":"#REF!"},{"$error":"#REF!"},{"$error":"#REF!"},{"$error":"#REF!"},{"$error":"#REF!"},{"$error":"#REF!"},{"$error":"#REF!"},{"$error":"#REF!"},{"$error":"#REF!"},{"$error":"#REF!"},{"$error":"#REF!"},{"$error":"#REF!"},{"$error":"#REF!"},{"$error":"#REF!"},{"$error":"#REF!"},{"$error":"#REF!"}]
[null,null,"[13.1] >= [13.3]","Reguła logiczna:  [15.1] >= [15.1.1]","x","x","x","x",{"$f":"IF(I112>=I113,\"OK\",\"BŁĄD\")","v":"OK"},{"$f":"IF(J112>=J113,\"OK\",\"BŁĄD\")","v":"OK"},"OK","OK",{"$error":"#REF!"},{"$error":"#REF!"},{"$error":"#REF!"},{"$error":"#REF!"},{"$error":"#REF!"},{"$error":"#REF!"},{"$error":"#REF!"},{"$error":"#REF!"},{"$error":"#REF!"},{"$error":"#REF!"},{"$error":"#REF!"},{"$error":"#REF!"},{"$error":"#REF!"},{"$error":"#REF!"},{"$error":"#REF!"},{"$error":"#REF!"},{"$error":"#REF!"},{"$error":"#REF!"},{"$error":"#REF!"},{"$error":"#REF!"},{"$error":"#REF!"},{"$error":"#REF!"},{"$error":"#REF!"},{"$error":"#REF!"},{"$error":"#REF!"},{"$error":"#REF!"}]
[null,null,"[2.1.1] >= [2.1.1.1]","Reguła logiczna:  [2.1.1] >= [2.1.1.1]","x","x","x","x",{"$f":"IF(I23>=I24,\"OK\",\"BŁĄD\")","v":"OK"},"OK","OK","OK",{"$error":"#REF!"},{"$error":"#REF!"},{"$error":"#REF!"},{"$error":"#REF!"},{"$error":"#REF!"},{"$error":"#REF!"},{"$error":"#REF!"},{"$error":"#REF!"},{"$error":"#REF!"},{"$error":"#REF!"},{"$error":"#REF!"},{"$error":"#REF!"},{"$error":"#REF!"},{"$error":"#REF!"},{"$error":"#REF!"},{"$error":"#REF!"},{"$error":"#REF!"},{"$error":"#REF!"},{"$error":"#REF!"},{"$error":"#REF!"},{"$error":"#REF!"},{"$error":"#REF!"},{"$error":"#REF!"},{"$error":"#REF!"},{"$error":"#REF!"},{"$error":"#REF!"}]
[null,null,"[2.1.1] >= [14.3.3]","Reguła logiczna:  [2.1.1] >= [14.3.3]","x","x","x","x",{"$f":"IF(I23>=I109,\"OK\",\"BŁĄD\")","v":"OK"},"OK","OK","OK",{"$error":"#REF!"},{"$error":"#REF!"},{"$error":"#REF!"},{"$error":"#REF!"},{"$error":"#REF!"},{"$error":"#REF!"},{"$error":"#REF!"},{"$error":"#REF!"},{"$error":"#REF!"},{"$error":"#REF!"},{"$error":"#REF!"},{"$error":"#REF!"},{"$error":"#REF!"},{"$error":"#REF!"},{"$error":"#REF!"},{"$error":"#REF!"},{"$error":"#REF!"},{"$error":"#REF!"},{"$error":"#REF!"},{"$error":"#REF!"},{"$error":"#REF!"},{"$error":"#REF!"},{"$error":"#REF!"},{"$error":"#REF!"},{"$error":"#REF!"},{"$error":"#REF!"}]
[null,null,"[2.1.3] >= [2.1.3.1] ","Reguła logiczna:  [2.1.3] >= [2.1.3.1] ","x","x","x","x",{"$f":"IF(I26>=I27,\"OK\",\"BŁĄD\")","v":"OK"},"OK","OK","OK",{"$error":"#REF!"},{"$error":"#REF!"},{"$error":"#REF!"},{"$error":"#REF!"},{"$error":"#REF!"},{"$error":"#REF!"},{"$error":"#REF!"},{"$error":"#REF!"},{"$error":"#REF!"},{"$error":"#REF!"},{"$error":"#REF!"},{"$error":"#REF!"},{"$error":"#REF!"},{"$error":"#REF!"},{"$error":"#REF!"},{"$error":"#REF!"},{"$error":"#REF!"},{"$error":"#REF!"},{"$error":"#REF!"},{"$error":"#REF!"},{"$error":"#REF!"},{"$error":"#REF!"},{"$error":"#REF!"},{"$error":"#REF!"},{"$error":"#REF!"},{"$error":"#REF!"}]
[null,null,"[2.1.3] >= [2.1.3.1] ","Reguła logiczna:  [2.1.3.1] >= [2.1.3.1.1]+[2.1.3.1.2] ","x","x","x","x",{"$f":"IF(I27>=(I28+I29),\"OK\",\"BŁĄD\")","v":"OK"},{"$f":"IF(J27>=J28,\"OK\",\"BŁĄD\")","v":"OK"},"OK","OK",{"$error":"#REF!"},{"$error":"#REF!"},{"$error":"#REF!"},{"$error":"#REF!"},{"$error":"#REF!"},{"$error":"#REF!"},{"$error":"#REF!"},{"$error":"#REF!"},{"$error":"#REF!"},{"$error":"#REF!"},{"$error":"#REF!"},{"$error":"#REF!"},{"$error":"#REF!"},{"$error":"#REF!"},{"$error":"#REF!"},{"$error":"#REF!"},{"$error":"#REF!"},{"$error":"#REF!"},{"$error":"#REF!"},{"$error":"#REF!"},{"$error":"#REF!"},{"$error":"#REF!"},{"$error":"#REF!"},{"$error":"#REF!"},{"$error":"#REF!"},{"$error":"#REF!"}]
[null,null,"[2.1] >= ([2.1.1] + [2.1.2] + [2.1.3])","Reguła logiczna:  [2.1] >= ([2.1.1] + [2.1.2] + [2.1.3])","x","x","x","x",{"$f":"IF(I22>=(I23+I25+I26),\"OK\",\"BŁĄD\")","v":"OK"},"OK","OK","OK",{"$error":"#REF!"},{"$error":"#REF!"},{"$error":"#REF!"},{"$error":"#REF!"},{"$error":"#REF!"},{"$error":"#REF!"},{"$error":"#REF!"},{"$error":"#REF!"},{"$error":"#REF!"},{"$error":"#REF!"},{"$error":"#REF!"},{"$error":"#REF!"},{"$error":"#REF!"},{"$error":"#REF!"},{"$error":"#REF!"},{"$error":"#REF!"},{"$error":"#REF!"},{"$error":"#REF!"},{"$error":"#REF!"},{"$error":"#REF!"},{"$error":"#REF!"},{"$error":"#REF!"},{"$error":"#REF!"},{"$error":"#REF!"},{"$error":"#REF!"},{"$error":"#REF!"}]
[null,null,"[2.1] >= [11.1]","Reguła logiczna:  [2.1] >= [11.1]","x","x","x","x",{"$f":"IF(I22>=I66,\"OK\",\"BŁĄD\")","v":"OK"},"OK","OK","OK",{"$error":"#REF!"},{"$error":"#REF!"},{"$error":"#REF!"},{"$error":"#REF!"},{"$error":"#REF!"},{"$error":"#REF!"},{"$error":"#REF!"},{"$error":"#REF!"},{"$error":"#REF!"},{"$error":"#REF!"},{"$error":"#REF!"},{"$error":"#REF!"},{"$error":"#REF!"},{"$error":"#REF!"},{"$error":"#REF!"},{"$error":"#REF!"},{"$error":"#REF!"},{"$error":"#REF!"},{"$error":"#REF!"},{"$error":"#REF!"},{"$error":"#REF!"},{"$error":"#REF!"},{"$error":"#REF!"},{"$error":"#REF!"},{"$error":"#REF!"},{"$error":"#REF!"}]
[null,null,"[2.1] >= [11.3.1]","Reguła logiczna:  [2.1] >= [11.3.1]","x","x","x","x",{"$f":"IF(I22>=I69,\"OK\",\"BŁĄD\")","v":"OK"},"OK","OK","OK",{"$error":"#REF!"},{"$error":"#REF!"},{"$error":"#REF!"},{"$error":"#REF!"},{"$error":"#REF!"},{"$error":"#REF!"},{"$error":"#REF!"},{"$error":"#REF!"},{"$error":"#REF!"},{"$error":"#REF!"},{"$error":"#REF!"},{"$error":"#REF!"},{"$error":"#REF!"},{"$error":"#REF!"},{"$error":"#REF!"},{"$error":"#REF!"},{"$error":"#REF!"},{"$error":"#REF!"},{"$error":"#REF!"},{"$error":"#REF!"},{"$error":"#REF!"},{"$error":"#REF!"},{"$error":"#REF!"},{"$error":"#REF!"},{"$error":"#REF!"},{"$error":"#REF!"}]
[null,null,"[2.1] >= [12.3]","Reguła logiczna:  [2.1] >= [12.3]","x","x","x","x",{"$f":"IF(I22>=I81,\"OK\",\"BŁĄD\")","v":"OK"},"OK","OK","OK",{"$error":"#REF!"},{"$error":"#REF!"},{"$error":"#REF!"},{"$error":"#REF!"},{"$error":"#REF!"},{"$error":"#REF!"},{"$error":"#REF!"},{"$error":"#REF!"},{"$error":"#REF!"},{"$error":"#REF!"},{"$error":"#REF!"},{"$error":"#REF!"},{"$error":"#REF!"},{"$error":"#REF!"},{"$error":"#REF!"},{"$error":"#REF!"},{"$error":"#REF!"},{"$error":"#REF!"},{"$error":"#REF!"},{"$error":"#REF!"},{"$error":"#REF!"},{"$error":"#REF!"},{"$error":"#REF!"},{"$error":"#REF!"},{"$error":"#REF!"},{"$error":"#REF!"}]
[null,null,"[2.1] >= [13.7]","Reguła logiczna:  [2.1] >= [13.7]","x","x","x","x",{"$f":"IF(I22>=I102,\"OK\",\"BŁĄD\")","v":"OK"},"OK","OK","OK",{"$error":"#REF!"},{"$error":"#REF!"},{"$error":"#REF!"},{"$error":"#REF!"},{"$error":"#REF!"},{"$error":"#REF!"},{"$error":"#REF!"},{"$error":"#REF!"},{"$error":"#REF!"},{"$error":"#REF!"},{"$error":"#REF!"},{"$error":"#REF!"},{"$error":"#REF!"},{"$error":"#REF!"},{"$error":"#REF!"},{"$error":"#REF!"},{"$error":"#REF!"},{"$error":"#REF!"},{"$error":"#REF!"},{"$error":"#REF!"},{"$error":"#REF!"},{"$error":"#REF!"},{"$error":"#REF!"},{"$error":"#REF!"},{"$error":"#REF!"},{"$error":"#REF!"}]
[null,null,"[2.2] >= [11.3.2]","Reguła logiczna:  [2.2] >= [11.3.2]","x","x","x","x",{"$f":"IF(I30>=I70,\"OK\",\"BŁĄD\")","v":"OK"},"OK","OK","OK",{"$error":"#REF!"},{"$error":"#REF!"},{"$error":"#REF!"},{"$error":"#REF!"},{"$error":"#REF!"},{"$error":"#REF!"},{"$error":"#REF!"},{"$error":"#REF!"},{"$error":"#REF!"},{"$error":"#REF!"},{"$error":"#REF!"},{"$error":"#REF!"},{"$error":"#REF!"},{"$error":"#REF!"},{"$error":"#REF!"},{"$error":"#REF!"},{"$error":"#REF!"},{"$error":"#REF!"},{"$error":"#REF!"},{"$error":"#REF!"},{"$error":"#REF!"},{"$error":"#REF!"},{"$error":"#REF!"},{"$error":"#REF!"},{"$error":"#REF!"},{"$error":"#REF!"}]
[null,null,"[2.2] >= [11.4] + [11.5]","Reguła logiczna:  [2.2] >= [11.4] + [11.5]","x","x","x","x",{"$f":"IF(I30>=I71+I72,\"OK\",\"BŁĄD\")","v":"OK"},"OK","OK","OK",{"$error":"#REF!"},{"$error":"#REF!"},{"$error":"#REF!"},{"$error":"#REF!"},{"$error":"#REF!"},{"$error":"#REF!"},{"$error":"#REF!"},{"$error":"#REF!"},{"$error":"#REF!"},{"$error":"#REF!"},{"$error":"#REF!"},{"$error":"#REF!"},{"$error":"#REF!"},{"$error":"#REF!"},{"$error":"#REF!"},{"$error":"#REF!"},{"$error":"#REF!"},{"$error":"#REF!"},{"$error":"#REF!"},{"$error":"#REF!"},{"$error":"#REF!"},{"$error":"#REF!"},{"$error":"#REF!"},{"$error":"#REF!"},{"$error":"#REF!"},{"$error":"#REF!"}]
[null,null,"[2.2] >= [11.6]","Reguła logiczna:  [2.2] >= [11.6]","x","x","x","x",{"$f":"IF(I30>=I73,\"OK\",\"BŁĄD\")","v":"OK"},"OK","OK","OK",{"$error":"#REF!"},{"$error":"#REF!"},{"$error":"#REF!"},{"$error":"#REF!"},{"$error":"#REF!"},{"$error":"#REF!"},{"$error":"#REF!"},{"$error":"#REF!"},{"$error":"#REF!"},{"$error":"#REF!"},{"$error":"#REF!"},{"$error":"#REF!"},{"$error":"#REF!"},{"$error":"#REF!"},{"$error":"#REF!"},{"$error":"#REF!"},{"$error":"#REF!"},{"$error":"#REF!"},{"$error":"#REF!"},{"$error":"#REF!"},{"$error":"#REF!"},{"$error":"#REF!"},{"$error":"#REF!"},{"$error":"#REF!"},{"$error":"#REF!"},{"$error":"#REF!"}]
[null,null,"[2.2] >= [12.4]","Reguła logiczna:  [2.2] >= [12.4]","x","x","x","x",{"$f":"IF(I30>=I84,\"OK\",\"BŁĄD\")","v":"OK"},"OK","OK","OK",{"$error":"#REF!"},{"$error":"#REF!"},{"$error":"#REF!"},{"$error":"#REF!"},{"$error":"#REF!"},{"$error":"#REF!"},{"$error":"#REF!"},{"$error":"#REF!"},{"$error":"#REF!"},{"$error":"#REF!"},{"$error":"#REF!"},{"$error":"#REF!"},{"$error":"#REF!"},{"$error":"#REF!"},{"$error":"#REF!"},{"$error":"#REF!"},{"$error":"#REF!"},{"$error":"#REF!"},{"$error":"#REF!"},{"$error":"#REF!"},{"$error":"#REF!"},{"$error":"#REF!"},{"$error":"#REF!"},{"$error":"#REF!"},{"$error":"#REF!"},{"$error":"#REF!"}]
[null,null,"[4.1] >= [4.1.1]","Reguła logiczna:  [4.1] >= [4.1.1]","x","x","x","x",{"$f":"IF(I33>=I34,\"OK\",\"BŁĄD\")","v":"OK"},"OK","OK","OK",{"$error":"#REF!"},{"$error":"#REF!"},{"$error":"#REF!"},{"$error":"#REF!"},{"$error":"#REF!"},{"$error":"#REF!"},{"$error":"#REF!"},{"$error":"#REF!"},{"$error":"#REF!"},{"$error":"#REF!"},{"$error":"#REF!"},{"$error":"#REF!"},{"$error":"#REF!"},{"$error":"#REF!"},{"$error":"#REF!"},{"$error":"#REF!"},{"$error":"#REF!"},{"$error":"#REF!"},{"$error":"#REF!"},{"$error":"#REF!"},{"$error":"#REF!"},{"$error":"#REF!"},{"$error":"#REF!"},{"$error":"#REF!"},{"$error":"#REF!"},{"$error":"#REF!"}]
[null,null,"[4.2] >= [4.2.1]","Reguła logiczna:  [4.2] >= [4.2.1]","x","x","x","x",{"$f":"IF(I35>=I36,\"OK\",\"BŁĄD\")","v":"OK"},"OK","OK","OK",{"$error":"#REF!"},{"$error":"#REF!"},{"$error":"#REF!"},{"$error":"#REF!"},{"$error":"#REF!"},{"$error":"#REF!"},{"$error":"#REF!"},{"$error":"#REF!"},{"$error":"#REF!"},{"$error":"#REF!"},{"$error":"#REF!"},{"$error":"#REF!"},{"$error":"#REF!"},{"$error":"#REF!"},{"$error":"#REF!"},{"$error":"#REF!"},{"$error":"#REF!"},{"$error":"#REF!"},{"$error":"#REF!"},{"$error":"#REF!"},{"$error":"#REF!"},{"$error":"#REF!"},{"$error":"#REF!"},{"$error":"#REF!"},{"$error":"#REF!"},{"$error":"#REF!"}]
[null,null,"[4.3] >= [4.3.1]","Reguła logiczna:  [4.3] >= [4.3.1]","x","x","x","x",{"$f":"IF(I37>=I38,\"OK\",\"BŁĄD\")","v":"OK"},"OK","OK","OK",{"$error":"#REF!"},{"$error":"#REF!"},{"$error":"#REF!"},{"$error":"#REF!"},{"$error":"#REF!"},{"$error":"#REF!"},{"$error":"#REF!"},{"$error":"#REF!"},{"$error":"#REF!"},{"$error":"#REF!"},{"$error":"#REF!"},{"$error":"#REF!"},{"$error":"#REF!"},{"$error":"#REF!"},{"$error":"#REF!"},{"$error":"#REF!"},{"$error":"#REF!"},{"$error":"#REF!"},{"$error":"#REF!"},{"$error":"#REF!"},{"$error":"#REF!"},{"$error":"#REF!"},{"$error":"#REF!"},{"$error":"#REF!"},{"$error":"#REF!"},{"$error":"#REF!"}]
[null,null,"[4.4] >= [4.4.1]","Reguła logiczna:  [4.4] >= [4.4.1]","x","x","x","x",{"$f":"IF(I39>=I40,\"OK\",\"BŁĄD\")","v":"OK"},"OK","OK","OK",{"$error":"#REF!"},{"$error":"#REF!"},{"$error":"#REF!"},{"$error":"#REF!"},{"$error":"#REF!"},{"$error":"#REF!"},{"$error":"#REF!"},{"$error":"#REF!"},{"$error":"#REF!"},{"$error":"#REF!"},{"$error":"#REF!"},{"$error":"#REF!"},{"$error":"#REF!"},{"$error":"#REF!"},{"$error":"#REF!"},{"$error":"#REF!"},{"$error":"#REF!"},{"$error":"#REF!"},{"$error":"#REF!"},{"$error":"#REF!"},{"$error":"#REF!"},{"$error":"#REF!"},{"$error":"#REF!"},{"$error":"#REF!"},{"$error":"#REF!"},{"$error":"#REF!"}]
[null,null,"[5.1] >= [5.1.1]","Reguła logiczna:  [5.1] >= [5.1.1]","x","x","x","x",{"$f":"IF(I42>=I43,\"OK\",\"BŁĄD\")","v":"OK"},"OK","OK","OK",{"$error":"#REF!"},{"$error":"#REF!"},{"$error":"#REF!"},{"$error":"#REF!"},{"$error":"#REF!"},{"$error":"#REF!"},{"$error":"#REF!"},{"$error":"#REF!"},{"$error":"#REF!"},{"$error":"#REF!"},{"$error":"#REF!"},{"$error":"#REF!"},{"$error":"#REF!"},{"$error":"#REF!"},{"$error":"#REF!"},{"$error":"#REF!"},{"$error":"#REF!"},{"$error":"#REF!"},{"$error":"#REF!"},{"$error":"#REF!"},{"$error":"#REF!"},{"$error":"#REF!"},{"$error":"#REF!"},{"$error":"#REF!"},{"$error":"#REF!"},{"$error":"#REF!"}]
[null,null,"[5.1] >= [10.1]","Reguła logiczna:  [5.1] >= [10.1]","x","x","x","x",{"$f":"IF(I42>=I64,\"OK\",\"BŁĄD\")","v":"OK"},"OK","OK","OK",{"$error":"#REF!"},{"$error":"#REF!"},{"$error":"#REF!"},{"$error":"#REF!"},{"$error":"#REF!"},{"$error":"#REF!"},{"$error":"#REF!"},{"$error":"#REF!"},{"$error":"#REF!"},{"$error":"#REF!"},{"$error":"#REF!"},{"$error":"#REF!"},{"$error":"#REF!"},{"$error":"#REF!"},{"$error":"#REF!"},{"$error":"#REF!"},{"$error":"#REF!"},{"$error":"#REF!"},{"$error":"#REF!"},{"$error":"#REF!"},{"$error":"#REF!"},{"$error":"#REF!"},{"$error":"#REF!"},{"$error":"#REF!"},{"$error":"#REF!"},{"$error":"#REF!"}]
[null,null,"[5.1] >= [14.1]","Reguła logiczna:  [5.1] >= [14.1]","x","x","x","x",{"$f":"IF(I42>=I104,\"OK\",\"BŁĄD\")","v":"OK"},"OK","OK","OK",{"$error":"#REF!"},{"$error":"#REF!"},{"$error":"#REF!"},{"$error":"#REF!"},{"$error":"#REF!"},{"$error":"#REF!"},{"$error":"#REF!"},{"$error":"#REF!"},{"$error":"#REF!"},{"$error":"#REF!"},{"$error":"#REF!"},{"$error":"#REF!"},{"$error":"#REF!"},{"$error":"#REF!"},{"$error":"#REF!"},{"$error":"#REF!"},{"$error":"#REF!"},{"$error":"#REF!"},{"$error":"#REF!"},{"$error":"#REF!"},{"$error":"#REF!"},{"$error":"#REF!"},{"$error":"#REF!"},{"$error":"#REF!"},{"$error":"#REF!"},{"$error":"#REF!"}]
[null,null,"[6] >=[7]","Reguła logiczna:  [6] >=[7]","x","x","x","x",{"$f":"IF(I48>=I49,\"OK\",\"BŁĄD\")","v":"OK"},"OK","OK","OK",{"$error":"#REF!"},{"$error":"#REF!"},{"$error":"#REF!"},{"$error":"#REF!"},{"$error":"#REF!"},{"$error":"#REF!"},{"$error":"#REF!"},{"$error":"#REF!"},{"$error":"#REF!"},{"$error":"#REF!"},{"$error":"#REF!"},{"$error":"#REF!"},{"$error":"#REF!"},{"$error":"#REF!"},{"$error":"#REF!"},{"$error":"#REF!"},{"$error":"#REF!"},{"$error":"#REF!"},{"$error":"#REF!"},{"$error":"#REF!"},{"$error":"#REF!"},{"$error":"#REF!"},{"$error":"#REF!"},{"$error":"#REF!"},{"$error":"#REF!"},{"$error":"#REF!"}]
[null,null,"[6] >= [14.2]","Reguła logiczna:  [6] >= [14.2]","x","x","x","x",{"$f":"IF(I48>=I105,\"OK\",\"BŁĄD\")","v":"OK"},"OK","OK","OK",{"$error":"#REF!"},{"$error":"#REF!"},{"$error":"#REF!"},{"$error":"#REF!"},{"$error":"#REF!"},{"$error":"#REF!"},{"$error":"#REF!"},{"$error":"#REF!"},{"$error":"#REF!"},{"$error":"#REF!"},{"$error":"#REF!"},{"$error":"#REF!"},{"$error":"#REF!"},{"$error":"#REF!"},{"$error":"#REF!"},{"$error":"#REF!"},{"$error":"#REF!"},{"$error":"#REF!"},{"$error":"#REF!"},{"$error":"#REF!"},{"$error":"#REF!"},{"$error":"#REF!"},{"$error":"#REF!"},{"$error":"#REF!"},{"$error":"#REF!"},{"$error":"#REF!"}]
[null,null,"7>=13.1","Reguła logiczna:  7>=13.1","x","x","x","x",{"$f":"IF(I49>=I96,\"OK\",\"BŁĄD\")","v":"OK"},"OK","OK","OK",{"$error":"#REF!"},{"$error":"#REF!"},{"$error":"#REF!"},{"$error":"#REF!"},{"$error":"#REF!"},{"$error":"#REF!"},{"$error":"#REF!"},{"$error":"#REF!"},{"$error":"#REF!"},{"$error":"#REF!"},{"$error":"#REF!"},{"$error":"#REF!"},{"$error":"#REF!"},{"$error":"#REF!"},{"$error":"#REF!"},{"$error":"#REF!"},{"$error":"#REF!"},{"$error":"#REF!"},{"$error":"#REF!"},{"$error":"#REF!"},{"$error":"#REF!"},{"$error":"#REF!"},{"$error":"#REF!"},{"$error":"#REF!"},{"$error":"#REF!"},{"$error":"#REF!"}]
[null,null,"jeżeli [2.1.3] <> 0 to  [2.1.3.1] <> 0 ","Reguła logiczna:  jeżeli [2.1.3] <> 0 to  [2.1.3.1] <> 0 ","x","x","x","x",{"$f":"IF(I26<>0,IF(I27<>0,\"OK\",\"BŁĄD\"),\"N/D\")","v":"OK"},"OK","OK","N/D",{"$error":"#REF!"},{"$error":"#REF!"},{"$error":"#REF!"},{"$error":"#REF!"},{"$error":"#REF!"},{"$error":"#REF!"},{"$error":"#REF!"},{"$error":"#REF!"},{"$error":"#REF!"},{"$error":"#REF!"},{"$error":"#REF!"},{"$error":"#REF!"},{"$error":"#REF!"},{"$error":"#REF!"},{"$error":"#REF!"},{"$error":"#REF!"},{"$error":"#REF!"},{"$error":"#REF!"},{"$error":"#REF!"},{"$error":"#REF!"},{"$error":"#REF!"},{"$error":"#REF!"},{"$error":"#REF!"},{"$error":"#REF!"},{"$error":"#REF!"},{"$error":"#REF!"}]
[]
[null,null,null,"Kontrola poprawności podstawowych kwot"]
[null,null,null,"Dochody ogółem = bieżące + majątkowe",{"$f":"E11+E18","v":14062028.149999999},12708280.6,15086054.130000001,15409938.1,11885236,13116110,13247270,13379740,{"$error":"#REF!"},{"$error":"#REF!"},{"$error":"#REF!"},{"$error":"#REF!"},{"$error":"#REF!"},{"$error":"#REF!"},{"$error":"#REF!"},{"$error":"#REF!"},{"$error":"#REF!"},{"$error":"#REF!"},{"$error":"#REF!"},{"$error":"#REF!"},{"$error":"#REF!"},{"$error":"#REF!"},{"$error":"#REF!"},{"$error":"#REF!"},{"$error":"#REF!"},{"$error":"#REF!"},{"$error":"#REF!"},{"$error":"#REF!"},{"$error":"#REF!"},{"$error":"#REF!"},{"$error":"#REF!"},{"$error":"#REF!"},{"$error":"#REF!"},{"$error":"#REF!"}]
[null,null,null,"Wydatki ogółem = bieżące + majątkowe",{"$f":"E22+E30","v":11481546.43},13777530.739999998,14983740.939999999,15322124.91,13118844,12414710,12545882.4,13379740,{"$error":"#REF!"},{"$error":"#REF!"},{"$error":"#REF!"},{"$error":"#REF!"},{"$error":"#REF!"},{"$error":"#REF!"},{"$error":"#REF!"},{"$error":"#REF!"},{"$error":"#REF!"},{"$error":"#REF!"},{"$error":"#REF!"},{"$error":"#REF!"},{"$error":"#REF!"},{"$error":"#REF!"},{"$error":"#REF!"},{"$error":"#REF!"},{"$error":"#REF!"},{"$error":"#REF!"},{"$error":"#REF!"},{"$error":"#REF!"},{"$error":"#REF!"},{"$error":"#REF!"},{"$error":"#REF!"},{"$error":"#REF!"},{"$error":"#REF!"},{"$error":"#REF!"}]
[null,null,null,"Wynik budżetu = dochody ogółem - wydatki ogółem",{"$f":"E10-E21","v":2580481.7200000007},-1069250.1400000006,102313.19000000134,87813.189999999478,-1233608,701400,701387.59999999963,0,{"$error":"#REF!"},{"$error":"#REF!"},{"$error":"#REF!"},{"$error":"#REF!"},{"$error":"#REF!"},{"$error":"#REF!"},{"$error":"#REF!"},{"$error":"#REF!"},{"$error":"#REF!"},{"$error":"#REF!"},{"$error":"#REF!"},{"$error":"#REF!"},{"$error":"#REF!"},{"$error":"#REF!"},{"$error":"#REF!"},{"$error":"#REF!"},{"$error":"#REF!"},{"$error":"#REF!"},{"$error":"#REF!"},{"$error":"#REF!"},{"$error":"#REF!"},{"$error":"#REF!"},{"$error":"#REF!"},{"$error":"#REF!"},{"$error":"#REF!"},{"$error":"#REF!"}]
[null,null,null,"Wyliczenie kwoty długu","x",{"$f":"E48+F37-F42+(F105-E105)+F110","v":773956.19},"x",{"$f":"F48+H37-H42+(H105-F105)+H110","v":169179.59999999998},{"$f":"H48+I37-I42+(I105-H105)+I110","v":1402787.6},701387.60000000009,1.1641532182693481E-10,1.1641532182693481E-10,{"$error":"#REF!"},{"$error":"#REF!"},{"$error":"#REF!"},{"$error":"#REF!"},{"$error":"#REF!"},{"$error":"#REF!"},{"$error":"#REF!"},{"$error":"#REF!"},{"$error":"#REF!"},{"$error":"#REF!"},{"$error":"#REF!"},{"$error":"#REF!"},{"$error":"#REF!"},{"$error":"#REF!"},{"$error":"#REF!"},{"$error":"#REF!"},{"$error":"#REF!"},{"$error":"#REF!"},{"$error":"#REF!"},{"$error":"#REF!"},{"$error":"#REF!"},{"$error":"#REF!"},{"$error":"#REF!"},{"$error":"#REF!"},{"$error":"#REF!"},{"$error":"#REF!"}]
[null,null,null,"Wyliczenie zobowiązań wynikających z przejęcia przez jst zobowiązań po likwidowanych i przekształcanych SZOZ","x",{"$f":"E96-(F98+F99+F100+F101)","v":0},"x",{"$f":"F96-(H98+H99+H100+H101)","v":0},{"$f":"H96-(I98+I99+I100+I101)","v":0},0,0,0,{"$error":"#REF!"},{"$error":"#REF!"},{"$error":"#REF!"},{"$error":"#REF!"},{"$error":"#REF!"},{"$error":"#REF!"},{"$error":"#REF!"},{"$error":"#REF!"},{"$error":"#REF!"},{"$error":"#REF!"},{"$error":"#REF!"},{"$error":"#REF!"},{"$error":"#REF!"},{"$error":"#REF!"},{"$error":"#REF!"},{"$error":"#REF!"},{"$error":"#REF!"},{"$error":"#REF!"},{"$error":"#REF!"},{"$error":"#REF!"},{"$error":"#REF!"},{"$error":"#REF!"},{"$error":"#REF!"},{"$error":"#REF!"},{"$error":"#REF!"},{"$error":"#REF!"}]
[]
[null,null,null,"Analiza ryzyka niespełnienia wskaźnika z art. 243"]
[null,null,null,"Analiza składowych wzoru wskaźnika z art. 243"]
[null,null,null,0,{"$f":"+\"różnica mniejsza od \"&TEXT(D197*100,\"0,0\")&\"%\"","v":"różnica mniejsza od 0,0%"}]
[null,null,null,5.0000000000000001E-3,{"$f":"+\"różnica mniejsza od \"&TEXT(D198*100,\"0,0\")&\"%\"","v":"różnica mniejsza od 0,5%"}]
[null,null,null,0.01,{"$f":"+\"różnica mniejsza od \"&TEXT(D199*100,\"0,0\")&\"%\"","v":"różnica mniejsza od 1,0%"}]
[null,null,null,"max. limit spłat (planistyczny) - (R+O)/D (bez wyłączeń)","x","x","x","x",{"$f":"+IF(I10=0,\"\",I59-I54)","v":0.186},0.13303333333333334,0.15636666666666665,0.2445333333333333,{"$error":"#REF!"},{"$error":"#REF!"},{"$error":"#REF!"},{"$error":"#REF!"},{"$error":"#REF!"},{"$error":"#REF!"},{"$error":"#REF!"},{"$error":"#REF!"},{"$error":"#REF!"},{"$error":"#REF!"},{"$error":"#REF!"},{"$error":"#REF!"},{"$error":"#REF!"},{"$error":"#REF!"},{"$error":"#REF!"},{"$error":"#REF!"},{"$error":"#REF!"},{"$error":"#REF!"},{"$error":"#REF!"},{"$error":"#REF!"},{"$error":"#REF!"},{"$error":"#REF!"},{"$error":"#REF!"},{"$error":"#REF!"},{"$error":"#REF!"},{"$error":"#REF!"}]
[null,null,null,"max. limit spłat (planistyczny) - (R+O)/D (z wyłączeniami)","x","x","x","x",{"$f":"+IF(I10=0,\"\",I59-I55)","v":0.186},0.13303333333333334,0.15636666666666665,0.2445333333333333,{"$error":"#REF!"},{"$error":"#REF!"},{"$error":"#REF!"},{"$error":"#REF!"},{"$error":"#REF!"},{"$error":"#REF!"},{"$error":"#REF!"},{"$error":"#REF!"},{"$error":"#REF!"},{"$error":"#REF!"},{"$error":"#REF!"},{"$error":"#REF!"},{"$error":"#REF!"},{"$error":"#REF!"},{"$error":"#REF!"},{"$error":"#REF!"},{"$error":"#REF!"},{"$error":"#REF!"},{"$error":"#REF!"},{"$error":"#REF!"},{"$error":"#REF!"},{"$error":"#REF!"},{"$error":"#REF!"},{"$error":"#REF!"},{"$error":"#REF!"},{"$error":"#REF!"}]
[null,null,null,"max. limit spłat (wg wykonania) - (R+O)/D (bez wyłączeń)","x","x","x","x",{"$f":"+IF(I10=0,\"\",I60-I54)","v":0.18459999999999999},0.13170000000000001,0.155,0.2445,{"$error":"#REF!"},{"$error":"#REF!"},{"$error":"#REF!"},{"$error":"#REF!"},{"$error":"#REF!"},{"$error":"#REF!"},{"$error":"#REF!"},{"$error":"#REF!"},{"$error":"#REF!"},{"$error":"#REF!"},{"$error":"#REF!"},{"$error":"#REF!"},{"$error":"#REF!"},{"$error":"#REF!"},{"$error":"#REF!"},{"$error":"#REF!"},{"$error":"#REF!"},{"$error":"#REF!"},{"$error":"#REF!"},{"$error":"#REF!"},{"$error":"#REF!"},{"$error":"#REF!"},{"$error":"#REF!"},{"$error":"#REF!"},{"$error":"#REF!"},{"$error":"#REF!"}]
[null,null,null,"max. limit spłat (wg wykonania) - (R+O)/D (z wyłączeniami)","x","x","x","x",{"$f":"+IF(I10=0,\"\",I60-I55)","v":0.18459999999999999},0.13170000000000001,0.155,0.2445,{"$error":"#REF!"},{"$error":"#REF!"},{"$error":"#REF!"},{"$error":"#REF!"},{"$error":"#REF!"},{"$error":"#REF!"},{"$error":"#REF!"},{"$error":"#REF!"},{"$error":"#REF!"},{"$error":"#REF!"},{"$error":"#REF!"},{"$error":"#REF!"},{"$error":"#REF!"},{"$error":"#REF!"},{"$error":"#REF!"},{"$error":"#REF!"},{"$error":"#REF!"},{"$error":"#REF!"},{"$error":"#REF!"},{"$error":"#REF!"},{"$error":"#REF!"},{"$error":"#REF!"},{"$error":"#REF!"},{"$error":"#REF!"},{"$error":"#REF!"},{"$error":"#REF!"}]

{"sheet":"definicja","index":2,"n_rows":114,"n_cols":34,"rows_kept":114,"cut":false,"hidden":true,"merged":[]}
[]
[null,null,"dane z eWPF"]
[null,null,"dane z Rb"]
[]
[]
[]
[]
[]
[null,"Lp.","Wyszczególnienie",0,0,{"$f":"+E9+1","v":1},{"$f":"+F9+1","v":2},3,4,5,6,7,8,9,10,{"$f":"+O9+1","v":11},12,13,14,15,16,17,18,19,20,21,22,23,24,25,26,27,{"$f":"+AF9+1","v":28},{"$f":"+AG9+1","v":29}]
[10,1,"Dochody ogółem",{"$f":"+\"rokwzgl=\"&D$9&\" i lp=\"&$A10","v":"rokwzgl=0 i lp=10"},"rokwzgl=0 i lp=10","rokwzgl=1 i lp=10","rokwzgl=2 i lp=10","rokwzgl=3 i lp=10","rokwzgl=4 i lp=10","rokwzgl=5 i lp=10","rokwzgl=6 i lp=10","rokwzgl=7 i lp=10","rokwzgl=8 i lp=10",{"$f":"+\"rokwzgl=\"&N$9&\" i lp=\"&$A10","v":"rokwzgl=9 i lp=10"},"rokwzgl=10 i lp=10","rokwzgl=11 i lp=10","rokwzgl=12 i lp=10","rokwzgl=13 i lp=10","rokwzgl=14 i lp=10","rokwzgl=15 i lp=10","rokwzgl=16 i lp=10","rokwzgl=17 i lp=10","rokwzgl=18 i lp=10",{"$f":"+\"rokwzgl=\"&X$9&\" i lp=\"&$A10","v":"rokwzgl=19 i lp=10"},"rokwzgl=20 i lp=10","rokwzgl=21 i lp=10","rokwzgl=22 i lp=10","rokwzgl=23 i lp=10","rokwzgl=24 i lp=10","rokwzgl=25 i lp=10","rokwzgl=26 i lp=10","rokwzgl=27 i lp=10","rokwzgl=28 i lp=10","rokwzgl=29 i lp=10"]
[20,"1.1"," Dochody bieżące","rokwzgl=0 i lp=20","rokwzgl=0 i lp=20","rokwzgl=1 i lp=20","rokwzgl=2 i lp=20","rokwzgl=3 i lp=20","rokwzgl=4 i lp=20","rokwzgl=5 i lp=20","rokwzgl=6 i lp=20","rokwzgl=7 i lp=20","rokwzgl=8 i lp=20","rokwzgl=9 i lp=20","rokwzgl=10 i lp=20","rokwzgl=11 i lp=20","rokwzgl=12 i lp=20","rokwzgl=13 i lp=20","rokwzgl=14 i lp=20","rokwzgl=15 i lp=20","rokwzgl=16 i lp=20","rokwzgl=17 i lp=20","rokwzgl=18 i lp=20","rokwzgl=19 i lp=20","rokwzgl=20 i lp=20","rokwzgl=21 i lp=20","rokwzgl=22 i lp=20","rokwzgl=23 i lp=20","rokwzgl=24 i lp=20","rokwzgl=25 i lp=20","rokwzgl=26 i lp=20","rokwzgl=27 i lp=20","rokwzgl=28 i lp=20","rokwzgl=29 i lp=20"]
[30,"1.1.1","  dochody z tytułu udziału we wpływach z podatku dochodowego od osób fizycznych","rokwzgl=0 i lp=30","rokwzgl=0 i lp=30","rokwzgl=1 i lp=30","rokwzgl=2 i lp=30","rokwzgl=3 i lp=30","rokwzgl=4 i lp=30","rokwzgl=5 i lp=30","rokwzgl=6 i lp=30","rokwzgl=7 i lp=30","rokwzgl=8 i lp=30","rokwzgl=9 i lp=30","rokwzgl=10 i lp=30","rokwzgl=11 i lp=30","rokwzgl=12 i lp=30","rokwzgl=13 i lp=30","rokwzgl=14 i lp=30","rokwzgl=15 i lp=30","rokwzgl=16 i lp=30","rokwzgl=17 i lp=30","rokwzgl=18 i lp=30","rokwzgl=19 i lp=30","rokwzgl=20 i lp=30","rokwzgl=21 i lp=30","rokwzgl=22 i lp=30","rokwzgl=23 i lp=30","rokwzgl=24 i lp=30","rokwzgl=25 i lp=30","rokwzgl=26 i lp=30","rokwzgl=27 i lp=30","rokwzgl=28 i lp=30","rokwzgl=29 i lp=30"]
[40,"1.1.2","  dochody z tytułu udziału we wpływach z podatku dochodowego od osób prawnych","rokwzgl=0 i lp=40","rokwzgl=0 i lp=40","rokwzgl=1 i lp=40","rokwzgl=2 i lp=40","rokwzgl=3 i lp=40","rokwzgl=4 i lp=40","rokwzgl=5 i lp=40","rokwzgl=6 i lp=40","rokwzgl=7 i lp=40","rokwzgl=8 i lp=40","rokwzgl=9 i lp=40","rokwzgl=10 i lp=40","rokwzgl=11 i lp=40","rokwzgl=12 i lp=40","rokwzgl=13 i lp=40","rokwzgl=14 i lp=40","rokwzgl=15 i lp=40","rokwzgl=16 i lp=40","rokwzgl=17 i lp=40","rokwzgl=18 i lp=40","rokwzgl=19 i lp=40","rokwzgl=20 i lp=40","rokwzgl=21 i lp=40","rokwzgl=22 i lp=40","rokwzgl=23 i lp=40","rokwzgl=24 i lp=40","rokwzgl=25 i lp=40","rokwzgl=26 i lp=40","rokwzgl=27 i lp=40","rokwzgl=28 i lp=40","rokwzgl=29 i lp=40"]
[50,"1.1.3","  podatki i opłaty","rokwzgl=0 i lp=50","rokwzgl=0 i lp=50","rokwzgl=1 i lp=50","rokwzgl=2 i lp=50","rokwzgl=3 i lp=50","rokwzgl=4 i lp=50","rokwzgl=5 i lp=50","rokwzgl=6 i lp=50","rokwzgl=7 i lp=50","rokwzgl=8 i lp=50","rokwzgl=9 i lp=50","rokwzgl=10 i lp=50","rokwzgl=11 i lp=50","rokwzgl=12 i lp=50","rokwzgl=13 i lp=50","rokwzgl=14 i lp=50","rokwzgl=15 i lp=50","rokwzgl=16 i lp=50","rokwzgl=17 i lp=50","rokwzgl=18 i lp=50","rokwzgl=19 i lp=50","rokwzgl=20 i lp=50","rokwzgl=21 i lp=50","rokwzgl=22 i lp=50","rokwzgl=23 i lp=50","rokwzgl=24 i lp=50","rokwzgl=25 i lp=50","rokwzgl=26 i lp=50","rokwzgl=27 i lp=50","rokwzgl=28 i lp=50","rokwzgl=29 i lp=50"]
[60,"1.1.3.1","   z podatku od nieruchomości","rokwzgl=0 i lp=60","rokwzgl=0 i lp=60","rokwzgl=1 i lp=60","rokwzgl=2 i lp=60","rokwzgl=3 i lp=60","rokwzgl=4 i lp=60","rokwzgl=5 i lp=60","rokwzgl=6 i lp=60","rokwzgl=7 i lp=60","rokwzgl=8 i lp=60","rokwzgl=9 i lp=60","rokwzgl=10 i lp=60","rokwzgl=11 i lp=60","rokwzgl=12 i lp=60","rokwzgl=13 i lp=60","rokwzgl=14 i lp=60","rokwzgl=15 i lp=60","rokwzgl=16 i lp=60","rokwzgl=17 i lp=60","rokwzgl=18 i lp=60","rokwzgl=19 i lp=60","rokwzgl=20 i lp=60","rokwzgl=21 i lp=60","rokwzgl=22 i lp=60","rokwzgl=23 i lp=60","rokwzgl=24 i lp=60","rokwzgl=25 i lp=60","rokwzgl=26 i lp=60","rokwzgl=27 i lp=60","rokwzgl=28 i lp=60","rokwzgl=29 i lp=60"]
[70,"1.1.4","  z subwencji ogólnej","rokwzgl=0 i lp=70","rokwzgl=0 i lp=70","rokwzgl=1 i lp=70","rokwzgl=2 i lp=70","rokwzgl=3 i lp=70","rokwzgl=4 i lp=70","rokwzgl=5 i lp=70","rokwzgl=6 i lp=70","rokwzgl=7 i lp=70","rokwzgl=8 i lp=70","rokwzgl=9 i lp=70","rokwzgl=10 i lp=70","rokwzgl=11 i lp=70","rokwzgl=12 i lp=70","rokwzgl=13 i lp=70","rokwzgl=14 i lp=70","rokwzgl=15 i lp=70","rokwzgl=16 i lp=70","rokwzgl=17 i lp=70","rokwzgl=18 i lp=70","rokwzgl=19 i lp=70","rokwzgl=20 i lp=70","rokwzgl=21 i lp=70","rokwzgl=22 i lp=70","rokwzgl=23 i lp=70","rokwzgl=24 i lp=70","rokwzgl=25 i lp=70","rokwzgl=26 i lp=70","rokwzgl=27 i lp=70","rokwzgl=28 i lp=70","rokwzgl=29 i lp=70"]
[80,"1.1.5","  z tytułu dotacji i środków przeznaczonych na cele bieżące","rokwzgl=0 i lp=80","rokwzgl=0 i lp=80","rokwzgl=1 i lp=80","rokwzgl=2 i lp=80","rokwzgl=3 i lp=80","rokwzgl=4 i lp=80","rokwzgl=5 i lp=80","rokwzgl=6 i lp=80","rokwzgl=7 i lp=80","rokwzgl=8 i lp=80","rokwzgl=9 i lp=80","rokwzgl=10 i lp=80","rokwzgl=11 i lp=80","rokwzgl=12 i lp=80","rokwzgl=13 i lp=80","rokwzgl=14 i lp=80","rokwzgl=15 i lp=80","rokwzgl=16 i lp=80","rokwzgl=17 i lp=80","rokwzgl=18 i lp=80","rokwzgl=19 i lp=80","rokwzgl=20 i lp=80","rokwzgl=21 i lp=80","rokwzgl=22 i lp=80","rokwzgl=23 i lp=80","rokwzgl=24 i lp=80","rokwzgl=25 i lp=80","rokwzgl=26 i lp=80","rokwzgl=27 i lp=80","rokwzgl=28 i lp=80","rokwzgl=29 i lp=80"]
[90,"1.2","  Dochody majątkowe, w tym","rokwzgl=0 i lp=90","rokwzgl=0 i lp=90","rokwzgl=1 i lp=90","rokwzgl=2 i lp=90","rokwzgl=3 i lp=90","rokwzgl=4 i lp=90","rokwzgl=5 i lp=90","rokwzgl=6 i lp=90","rokwzgl=7 i lp=90","rokwzgl=8 i lp=90","rokwzgl=9 i lp=90","rokwzgl=10 i lp=90","rokwzgl=11 i lp=90","rokwzgl=12 i lp=90","rokwzgl=13 i lp=90","rokwzgl=14 i lp=90","rokwzgl=15 i lp=90","rokwzgl=16 i lp=90","rokwzgl=17 i lp=90","rokwzgl=18 i lp=90","rokwzgl=19 i lp=90","rokwzgl=20 i lp=90","rokwzgl=21 i lp=90","rokwzgl=22 i lp=90","rokwzgl=23 i lp=90","rokwzgl=24 i lp=90","rokwzgl=25 i lp=90","rokwzgl=26 i lp=90","rokwzgl=27 i lp=90","rokwzgl=28 i lp=90","rokwzgl=29 i lp=90"]
[100,"1.2.1","  ze sprzedaży majątku","rokwzgl=0 i lp=100","rokwzgl=0 i lp=100","rokwzgl=1 i lp=100","rokwzgl=2 i lp=100","rokwzgl=3 i lp=100","rokwzgl=4 i lp=100","rokwzgl=5 i lp=100","rokwzgl=6 i lp=100","rokwzgl=7 i lp=100","rokwzgl=8 i lp=100","rokwzgl=9 i lp=100","rokwzgl=10 i lp=100","rokwzgl=11 i lp=100","rokwzgl=12 i lp=100","rokwzgl=13 i lp=100","rokwzgl=14 i lp=100","rokwzgl=15 i lp=100","rokwzgl=16 i lp=100","rokwzgl=17 i lp=100","rokwzgl=18 i lp=100","rokwzgl=19 i lp=100","rokwzgl=20 i lp=100","rokwzgl=21 i lp=100","rokwzgl=22 i lp=100","rokwzgl=23 i lp=100","rokwzgl=24 i lp=100","rokwzgl=25 i lp=100","rokwzgl=26 i lp=100","rokwzgl=27 i lp=100","rokwzgl=28 i lp=100","rokwzgl=29 i lp=100"]
[110,"1.2.2","  z tytułu dotacji oraz środków przeznaczonych na inwestycje",{"$f":"+\"rokwzgl=\"&D$9&\" i lp=\"&$A20","v":"rokwzgl=0 i lp=110"},"rokwzgl=0 i lp=110","rokwzgl=1 i lp=110","rokwzgl=2 i lp=110","rokwzgl=3 i lp=110","rokwzgl=4 i lp=110","rokwzgl=5 i lp=110","rokwzgl=6 i lp=110","rokwzgl=7 i lp=110","rokwzgl=8 i lp=110",{"$f":"+\"rokwzgl=\"&N$9&\" i lp=\"&$A20","v":"rokwzgl=9 i lp=110"},"rokwzgl=10 i lp=110","rokwzgl=11 i lp=110","rokwzgl=12 i lp=110","rokwzgl=13 i lp=110","rokwzgl=14 i lp=110","rokwzgl=15 i lp=110","rokwzgl=16 i lp=110","rokwzgl=17 i lp=110","rokwzgl=18 i lp=110",{"$f":"+\"rokwzgl=\"&X$9&\" i lp=\"&$A20","v":"rokwzgl=19 i lp=110"},"rokwzgl=20 i lp=110","rokwzgl=21 i lp=110","rokwzgl=22 i lp=110","rokwzgl=23 i lp=110","rokwzgl=24 i lp=110","rokwzgl=25 i lp=110","rokwzgl=26 i lp=110","rokwzgl=27 i lp=110","rokwzgl=28 i lp=110","rokwzgl=29 i lp=110"]
[120,2,"Wydatki ogółem","rokwzgl=0 i lp=120","rokwzgl=0 i lp=120","rokwzgl=1 i lp=120","rokwzgl=2 i lp=120","rokwzgl=3 i lp=120","rokwzgl=4 i lp=120","rokwzgl=5 i lp=120","rokwzgl=6 i lp=120","rokwzgl=7 i lp=120","rokwzgl=8 i lp=120","rokwzgl=9 i lp=120","rokwzgl=10 i lp=120","rokwzgl=11 i lp=120","rokwzgl=12 i lp=120","rokwzgl=13 i lp=120","rokwzgl=14 i lp=120","rokwzgl=15 i lp=120","rokwzgl=16 i lp=120","rokwzgl=17 i lp=120","rokwzgl=18 i lp=120","rokwzgl=19 i lp=120","rokwzgl=20 i lp=120","rokwzgl=21 i lp=120","rokwzgl=22 i lp=120","rokwzgl=23 i lp=120","rokwzgl=24 i lp=120","rokwzgl=25 i lp=120","rokwzgl=26 i lp=120","rokwzgl=27 i lp=120","rokwzgl=28 i lp=120","rokwzgl=29 i lp=120"]
[130,"2.1"," Wydatki bieżące, w tym:","rokwzgl=0 i lp=130","rokwzgl=0 i lp=130","rokwzgl=1 i lp=130","rokwzgl=2 i lp=130","rokwzgl=3 i lp=130","rokwzgl=4 i lp=130","rokwzgl=5 i lp=130","rokwzgl=6 i lp=130","rokwzgl=7 i lp=130","rokwzgl=8 i lp=130","rokwzgl=9 i lp=130","rokwzgl=10 i lp=130","rokwzgl=11 i lp=130","rokwzgl=12 i lp=130","rokwzgl=13 i lp=130","rokwzgl=14 i lp=130","rokwzgl=15 i lp=130","rokwzgl=16 i lp=130","rokwzgl=17 i lp=130","rokwzgl=18 i lp=130","rokwzgl=19 i lp=130","rokwzgl=20 i lp=130","rokwzgl=21 i lp=130","rokwzgl=22 i lp=130","rokwzgl=23 i lp=130","rokwzgl=24 i lp=130","rokwzgl=25 i lp=130","rokwzgl=26 i lp=130","rokwzgl=27 i lp=130","rokwzgl=28 i lp=130","rokwzgl=29 i lp=130"]
[140,"2.1.1","  z tytułu poręczeń i gwarancji","rokwzgl=0 i lp=140","rokwzgl=0 i lp=140","rokwzgl=1 i lp=140","rokwzgl=2 i lp=140","rokwzgl=3 i lp=140","rokwzgl=4 i lp=140","rokwzgl=5 i lp=140","rokwzgl=6 i lp=140","rokwzgl=7 i lp=140","rokwzgl=8 i lp=140","rokwzgl=9 i lp=140","rokwzgl=10 i lp=140","rokwzgl=11 i lp=140","rokwzgl=12 i lp=140","rokwzgl=13 i lp=140","rokwzgl=14 i lp=140","rokwzgl=15 i lp=140","rokwzgl=16 i lp=140","rokwzgl=17 i lp=140","rokwzgl=18 i lp=140","rokwzgl=19 i lp=140","rokwzgl=20 i lp=140","rokwzgl=21 i lp=140","rokwzgl=22 i lp=140","rokwzgl=23 i lp=140","rokwzgl=24 i lp=140","rokwzgl=25 i lp=140","rokwzgl=26 i lp=140","rokwzgl=27 i lp=140","rokwzgl=28 i lp=140","rokwzgl=29 i lp=140"]
[150,"2.1.1.1","   w tym: gwarancje i poręczenia podlegające wyłączeniu z limitu spłaty zobowiązań, o którym mowa w art. 243 ustawy","rokwzgl=0 i lp=150","rokwzgl=0 i lp=150","rokwzgl=1 i lp=150","rokwzgl=2 i lp=150","rokwzgl=3 i lp=150","rokwzgl=4 i lp=150","rokwzgl=5 i lp=150","rokwzgl=6 i lp=150","rokwzgl=7 i lp=150","rokwzgl=8 i lp=150","rokwzgl=9 i lp=150","rokwzgl=10 i lp=150","rokwzgl=11 i lp=150","rokwzgl=12 i lp=150","rokwzgl=13 i lp=150","rokwzgl=14 i lp=150","rokwzgl=15 i lp=150","rokwzgl=16 i lp=150","rokwzgl=17 i lp=150","rokwzgl=18 i lp=150","rokwzgl=19 i lp=150","rokwzgl=20 i lp=150","rokwzgl=21 i lp=150","rokwzgl=22 i lp=150","rokwzgl=23 i lp=150","rokwzgl=24 i lp=150","rokwzgl=25 i lp=150","rokwzgl=26 i lp=150","rokwzgl=27 i lp=150","rokwzgl=28 i lp=150","rokwzgl=29 i lp=150"]
[160,"2.1.2","   na spłatę przejętych zobowiązań samodzielnego publicznego zakładu opieki zdrowotnej przekształconego na zasadach określonych w przepisach  o działalności leczniczej, w wysokości w jakiej nie podlegają sfinansowaniu dotacją z budżetu państwa","rokwzgl=0 i lp=160","rokwzgl=0 i lp=160","rokwzgl=1 i lp=160","rokwzgl=2 i lp=160","rokwzgl=3 i lp=160","rokwzgl=4 i lp=160","rokwzgl=5 i lp=160","rokwzgl=6 i lp=160","rokwzgl=7 i lp=160","rokwzgl=8 i lp=160","rokwzgl=9 i lp=160","rokwzgl=10 i lp=160","rokwzgl=11 i lp=160","rokwzgl=12 i lp=160","rokwzgl=13 i lp=160","rokwzgl=14 i lp=160","rokwzgl=15 i lp=160","rokwzgl=16 i lp=160","rokwzgl=17 i lp=160","rokwzgl=18 i lp=160","rokwzgl=19 i lp=160","rokwzgl=20 i lp=160","rokwzgl=21 i lp=160","rokwzgl=22 i lp=160","rokwzgl=23 i lp=160","rokwzgl=24 i lp=160","rokwzgl=25 i lp=160","rokwzgl=26 i lp=160","rokwzgl=27 i lp=160","rokwzgl=28 i lp=160","rokwzgl=29 i lp=160"]
[170,"2.1.3","  wydatki na obsługę długu, w tym:","rokwzgl=0 i lp=170","rokwzgl=0 i lp=170","rokwzgl=1 i lp=170","rokwzgl=2 i lp=170","rokwzgl=3 i lp=170","rokwzgl=4 i lp=170","rokwzgl=5 i lp=170","rokwzgl=6 i lp=170","rokwzgl=7 i lp=170","rokwzgl=8 i lp=170","rokwzgl=9 i lp=170","rokwzgl=10 i lp=170","rokwzgl=11 i lp=170","rokwzgl=12 i lp=170","rokwzgl=13 i lp=170","rokwzgl=14 i lp=170","rokwzgl=15 i lp=170","rokwzgl=16 i lp=170","rokwzgl=17 i lp=170","rokwzgl=18 i lp=170","rokwzgl=19 i lp=170","rokwzgl=20 i lp=170","rokwzgl=21 i lp=170","rokwzgl=22 i lp=170","rokwzgl=23 i lp=170","rokwzgl=24 i lp=170","rokwzgl=25 i lp=170","rokwzgl=26 i lp=170","rokwzgl=27 i lp=170","rokwzgl=28 i lp=170","rokwzgl=29 i lp=170"]
[180,"2.1.3.1","   odsetki i dyskonto określone w art. 243 ust. 1 ustawy, w tym:","rokwzgl=0 i lp=180","rokwzgl=0 i lp=180","rokwzgl=1 i lp=180","rokwzgl=2 i lp=180","rokwzgl=3 i lp=180","rokwzgl=4 i lp=180","rokwzgl=5 i lp=180","rokwzgl=6 i lp=180","rokwzgl=7 i lp=180","rokwzgl=8 i lp=180","rokwzgl=9 i lp=180","rokwzgl=10 i lp=180","rokwzgl=11 i lp=180","rokwzgl=12 i lp=180","rokwzgl=13 i lp=180","rokwzgl=14 i lp=180","rokwzgl=15 i lp=180","rokwzgl=16 i lp=180","rokwzgl=17 i lp=180","rokwzgl=18 i lp=180","rokwzgl=19 i lp=180","rokwzgl=20 i lp=180","rokwzgl=21 i lp=180","rokwzgl=22 i lp=180","rokwzgl=23 i lp=180","rokwzgl=24 i lp=180","rokwzgl=25 i lp=180","rokwzgl=26 i lp=180","rokwzgl=27 i lp=180","rokwzgl=28 i lp=180","rokwzgl=29 i lp=180"]
[182,"2.1.3.1.1","    odsetki i dyskonto podlegające wyłączeniu z limitu spłaty zobowiązań, o którym mowa w art. 243 ustawy, w terminie nie dłuższym niż 90 dni po zakończeniu programu, projektu lub zadania i otrzymaniu refundacji z tych środków (bez odsetek i dyskonta od zobowiązań na wkład krajowy)","rokwzgl=0 i lp=182","rokwzgl=0 i lp=182","rokwzgl=1 i lp=182","rokwzgl=2 i lp=182","rokwzgl=3 i lp=182","rokwzgl=4 i lp=182","rokwzgl=5 i lp=182","rokwzgl=6 i lp=182","rokwzgl=7 i lp=182","rokwzgl=8 i lp=182","rokwzgl=9 i lp=182","rokwzgl=10 i lp=182","rokwzgl=11 i lp=182","rokwzgl=12 i lp=182","rokwzgl=13 i lp=182","rokwzgl=14 i lp=182","rokwzgl=15 i lp=182","rokwzgl=16 i lp=182","rokwzgl=17 i lp=182","rokwzgl=18 i lp=182","rokwzgl=19 i lp=182","rokwzgl=20 i lp=182","rokwzgl=21 i lp=182","rokwzgl=22 i lp=182","rokwzgl=23 i lp=182","rokwzgl=24 i lp=182","rokwzgl=25 i lp=182","rokwzgl=26 i lp=182","rokwzgl=27 i lp=182","rokwzgl=28 i lp=182","rokwzgl=29 i lp=182"]
[184,"2.1.3.1.2","    odsetki i dyskonto podlegające wyłączeniu z limitu spłaty zobowiązań, o którym mowa w art. 243 ustawy, z tytułu zobowiązań  zaciągniętych na wkład krajowy","rokwzgl=0 i lp=184","rokwzgl=0 i lp=184","rokwzgl=1 i lp=184","rokwzgl=2 i lp=184","rokwzgl=3 i lp=184","rokwzgl=4 i lp=184","rokwzgl=5 i lp=184","rokwzgl=6 i lp=184","rokwzgl=7 i lp=184","rokwzgl=8 i lp=184","rokwzgl=9 i lp=184","rokwzgl=10 i lp=184","rokwzgl=11 i lp=184","rokwzgl=12 i lp=184","rokwzgl=13 i lp=184","rokwzgl=14 i lp=184","rokwzgl=15 i lp=184","rokwzgl=16 i lp=184","rokwzgl=17 i lp=184","rokwzgl=18 i lp=184","rokwzgl=19 i lp=184","rokwzgl=20 i lp=184","rokwzgl=21 i lp=184","rokwzgl=22 i lp=184","rokwzgl=23 i lp=184","rokwzgl=24 i lp=184","rokwzgl=25 i lp=184","rokwzgl=26 i lp=184","rokwzgl=27 i lp=184","rokwzgl=28 i lp=184","rokwzgl=29 i lp=184"]
[190,"2.2"," Wydatki majątkowe","rokwzgl=0 i lp=190","rokwzgl=0 i lp=190","rokwzgl=1 i lp=190","rokwzgl=2 i lp=190","rokwzgl=3 i lp=190","rokwzgl=4 i lp=190","rokwzgl=5 i lp=190","rokwzgl=6 i lp=190","rokwzgl=7 i lp=190","rokwzgl=8 i lp=190","rokwzgl=9 i lp=190","rokwzgl=10 i lp=190","rokwzgl=11 i lp=190","rokwzgl=12 i lp=190","rokwzgl=13 i lp=190","rokwzgl=14 i lp=190","rokwzgl=15 i lp=190","rokwzgl=16 i lp=190","rokwzgl=17 i lp=190","rokwzgl=18 i lp=190","rokwzgl=19 i lp=190","rokwzgl=20 i lp=190","rokwzgl=21 i lp=190","rokwzgl=22 i lp=190","rokwzgl=23 i lp=190","rokwzgl=24 i lp=190","rokwzgl=25 i lp=190","rokwzgl=26 i lp=190","rokwzgl=27 i lp=190","rokwzgl=28 i lp=190","rokwzgl=29 i lp=190"]
[200,3,"Wynik budżetu","rokwzgl=0 i lp=200","rokwzgl=0 i lp=200","rokwzgl=1 i lp=200","rokwzgl=2 i lp=200","rokwzgl=3 i lp=200","rokwzgl=4 i lp=200","rokwzgl=5 i lp=200","rokwzgl=6 i lp=200","rokwzgl=7 i lp=200","rokwzgl=8 i lp=200","rokwzgl=9 i lp=200","rokwzgl=10 i lp=200","rokwzgl=11 i lp=200","rokwzgl=12 i lp=200","rokwzgl=13 i lp=200","rokwzgl=14 i lp=200","rokwzgl=15 i lp=200","rokwzgl=16 i lp=200","rokwzgl=17 i lp=200","rokwzgl=18 i lp=200","rokwzgl=19 i lp=200","rokwzgl=20 i lp=200","rokwzgl=21 i lp=200","rokwzgl=22 i lp=200","rokwzgl=23 i lp=200","rokwzgl=24 i lp=200","rokwzgl=25 i lp=200","rokwzgl=26 i lp=200","rokwzgl=27 i lp=200","rokwzgl=28 i lp=200","rokwzgl=29 i lp=200"]
[210,4,"Przychody budżetu","rokwzgl=0 i lp=210","rokwzgl=0 i lp=210","rokwzgl=1 i lp=210","rokwzgl=2 i lp=210","rokwzgl=3 i lp=210","rokwzgl=4 i lp=210","rokwzgl=5 i lp=210","rokwzgl=6 i lp=210","rokwzgl=7 i lp=210","rokwzgl=8 i lp=210","rokwzgl=9 i lp=210","rokwzgl=10 i lp=210","rokwzgl=11 i lp=210","rokwzgl=12 i lp=210","rokwzgl=13 i lp=210","rokwzgl=14 i lp=210","rokwzgl=15 i lp=210","rokwzgl=16 i lp=210","rokwzgl=17 i lp=210","rokwzgl=18 i lp=210","rokwzgl=19 i lp=210","rokwzgl=20 i lp=210","rokwzgl=21 i lp=210","rokwzgl=22 i lp=210","rokwzgl=23 i lp=210","rokwzgl=24 i lp=210","rokwzgl=25 i lp=210","rokwzgl=26 i lp=210","rokwzgl=27 i lp=210","rokwzgl=28 i lp=210","rokwzgl=29 i lp=210"]
[220,"4.1"," Nadwyżka budżetowa z lat ubiegłych","rokwzgl=0 i lp=220","rokwzgl=0 i lp=220","rokwzgl=1 i lp=220","rokwzgl=2 i lp=220","rokwzgl=3 i lp=220","rokwzgl=4 i lp=220","rokwzgl=5 i lp=220","rokwzgl=6 i lp=220","rokwzgl=7 i lp=220","rokwzgl=8 i lp=220","rokwzgl=9 i lp=220","rokwzgl=10 i lp=220","rokwzgl=11 i lp=220","rokwzgl=12 i lp=220","rokwzgl=13 i lp=220","rokwzgl=14 i lp=220","rokwzgl=15 i lp=220","rokwzgl=16 i lp=220","rokwzgl=17 i lp=220","rokwzgl=18 i lp=220","rokwzgl=19 i lp=220","rokwzgl=20 i lp=220","rokwzgl=21 i lp=220","rokwzgl=22 i lp=220","rokwzgl=23 i lp=220","rokwzgl=24 i lp=220","rokwzgl=25 i lp=220","rokwzgl=26 i lp=220","rokwzgl=27 i lp=220","rokwzgl=28 i lp=220","rokwzgl=29 i lp=220"]
[230,"4.1.1","  w tym na pokrycie deficytu budżetu","rokwzgl=0 i lp=230","rokwzgl=0 i lp=230","rokwzgl=1 i lp=230","rokwzgl=2 i lp=230","rokwzgl=3 i lp=230","rokwzgl=4 i lp=230","rokwzgl=5 i lp=230","rokwzgl=6 i lp=230","rokwzgl=7 i lp=230","rokwzgl=8 i lp=230","rokwzgl=9 i lp=230","rokwzgl=10 i lp=230","rokwzgl=11 i lp=230","rokwzgl=12 i lp=230","rokwzgl=13 i lp=230","rokwzgl=14 i lp=230","rokwzgl=15 i lp=230","rokwzgl=16 i lp=230","rokwzgl=17 i lp=230","rokwzgl=18 i lp=230","rokwzgl=19 i lp=230","rokwzgl=20 i lp=230","rokwzgl=21 i lp=230","rokwzgl=22 i lp=230","rokwzgl=23 i lp=230","rokwzgl=24 i lp=230","rokwzgl=25 i lp=230","rokwzgl=26 i lp=230","rokwzgl=27 i lp=230","rokwzgl=28 i lp=230","rokwzgl=29 i lp=230"]
[240,"4.2"," Wolne środki, o których mowa w art. 217 ust.2 pkt 6 ustawy","rokwzgl=0 i lp=240","rokwzgl=0 i lp=240","rokwzgl=1 i lp=240","rokwzgl=2 i lp=240","rokwzgl=3 i lp=240","rokwzgl=4 i lp=240","rokwzgl=5 i lp=240","rokwzgl=6 i lp=240","rokwzgl=7 i lp=240","rokwzgl=8 i lp=240","rokwzgl=9 i lp=240","rokwzgl=10 i lp=240","rokwzgl=11 i lp=240","rokwzgl=12 i lp=240","rokwzgl=13 i lp=240","rokwzgl=14 i lp=240","rokwzgl=15 i lp=240","rokwzgl=16 i lp=240","rokwzgl=17 i lp=240","rokwzgl=18 i lp=240","rokwzgl=19 i lp=240","rokwzgl=20 i lp=240","rokwzgl=21 i lp=240","rokwzgl=22 i lp=240","rokwzgl=23 i lp=240","rokwzgl=24 i lp=240","rokwzgl=25 i lp=240","rokwzgl=26 i lp=240","rokwzgl=27 i lp=240","rokwzgl=28 i lp=240","rokwzgl=29 i lp=240"]
[250,"4.2.1","   w tym na pokrycie deficytu budżetu",{"$f":"+\"rokwzgl=\"&D$9&\" i lp=\"&$A36","v":"rokwzgl=0 i lp=250"},"rokwzgl=0 i lp=250","rokwzgl=1 i lp=250","rokwzgl=2 i lp=250","rokwzgl=3 i lp=250","rokwzgl=4 i lp=250","rokwzgl=5 i lp=250","rokwzgl=6 i lp=250","rokwzgl=7 i lp=250","rokwzgl=8 i lp=250",{"$f":"+\"rokwzgl=\"&N$9&\" i lp=\"&$A36","v":"rokwzgl=9 i lp=250"},"rokwzgl=10 i lp=250","rokwzgl=11 i lp=250","rokwzgl=12 i lp=250","rokwzgl=13 i lp=250","rokwzgl=14 i lp=250","rokwzgl=15 i lp=250","rokwzgl=16 i lp=250","rokwzgl=17 i lp=250","rokwzgl=18 i lp=250",{"$f":"+\"rokwzgl=\"&X$9&\" i lp=\"&$A36","v":"rokwzgl=19 i lp=250"},"rokwzgl=20 i lp=250","rokwzgl=21 i lp=250","rokwzgl=22 i lp=250","rokwzgl=23 i lp=250","rokwzgl=24 i lp=250","rokwzgl=25 i lp=250","rokwzgl=26 i lp=250","rokwzgl=27 i lp=250","rokwzgl=28 i lp=250","rokwzgl=29 i lp=250"]
[260,"4.3","  Kredyty, pożyczki, emisja papierów wartościowych","rokwzgl=0 i lp=260","rokwzgl=0 i lp=260","rokwzgl=1 i lp=260","rokwzgl=2 i lp=260","rokwzgl=3 i lp=260","rokwzgl=4 i lp=260","rokwzgl=5 i lp=260","rokwzgl=6 i lp=260","rokwzgl=7 i lp=260","rokwzgl=8 i lp=260","rokwzgl=9 i lp=260","rokwzgl=10 i lp=260","rokwzgl=11 i lp=260","rokwzgl=12 i lp=260","rokwzgl=13 i lp=260","rokwzgl=14 i lp=260","rokwzgl=15 i lp=260","rokwzgl=16 i lp=260","rokwzgl=17 i lp=260","rokwzgl=18 i lp=260","rokwzgl=19 i lp=260","rokwzgl=20 i lp=260","rokwzgl=21 i lp=260","rokwzgl=22 i lp=260","rokwzgl=23 i lp=260","rokwzgl=24 i lp=260","rokwzgl=25 i lp=260","rokwzgl=26 i lp=260","rokwzgl=27 i lp=260","rokwzgl=28 i lp=260","rokwzgl=29 i lp=260"]
[270,"4.3.1","   w tym na pokrycie deficytu budżetu","rokwzgl=0 i lp=270","rokwzgl=0 i lp=270","rokwzgl=1 i lp=270","rokwzgl=2 i lp=270","rokwzgl=3 i lp=270","rokwzgl=4 i lp=270","rokwzgl=5 i lp=270","rokwzgl=6 i lp=270","rokwzgl=7 i lp=270","rokwzgl=8 i lp=270","rokwzgl=9 i lp=270","rokwzgl=10 i lp=270","rokwzgl=11 i lp=270","rokwzgl=12 i lp=270","rokwzgl=13 i lp=270","rokwzgl=14 i lp=270","rokwzgl=15 i lp=270","rokwzgl=16 i lp=270","rokwzgl=17 i lp=270","rokwzgl=18 i lp=270","rokwzgl=19 i lp=270","rokwzgl=20 i lp=270","rokwzgl=21 i lp=270","rokwzgl=22 i lp=270","rokwzgl=23 i lp=270","rokwzgl=24 i lp=270","rokwzgl=25 i lp=270","rokwzgl=26 i lp=270","rokwzgl=27 i lp=270","rokwzgl=28 i lp=270","rokwzgl=29 i lp=270"]
[280,"4.4"," Inne przychody niezwiązane z zaciągnięciem długu","rokwzgl=0 i lp=280","rokwzgl=0 i lp=280","rokwzgl=1 i lp=280","rokwzgl=2 i lp=280","rokwzgl=3 i lp=280","rokwzgl=4 i lp=280","rokwzgl=5 i lp=280","rokwzgl=6 i lp=280","rokwzgl=7 i lp=280","rokwzgl=8 i lp=280","rokwzgl=9 i lp=280","rokwzgl=10 i lp=280","rokwzgl=11 i lp=280","rokwzgl=12 i lp=280","rokwzgl=13 i lp=280","rokwzgl=14 i lp=280","rokwzgl=15 i lp=280","rokwzgl=16 i lp=280","rokwzgl=17 i lp=280","rokwzgl=18 i lp=280","rokwzgl=19 i lp=280","rokwzgl=20 i lp=280","rokwzgl=21 i lp=280","rokwzgl=22 i lp=280","rokwzgl=23 i lp=280","rokwzgl=24 i lp=280","rokwzgl=25 i lp=280","rokwzgl=26 i lp=280","rokwzgl=27 i lp=280","rokwzgl=28 i lp=280","rokwzgl=29 i lp=280"]
[290,"4.4.1","   w tym na pokrycie deficytu budżetu","rokwzgl=0 i lp=290","rokwzgl=0 i lp=290","rokwzgl=1 i lp=290","rokwzgl=2 i lp=290","rokwzgl=3 i lp=290","rokwzgl=4 i lp=290","rokwzgl=5 i lp=290","rokwzgl=6 i lp=290","rokwzgl=7 i lp=290","rokwzgl=8 i lp=290","rokwzgl=9 i lp=290","rokwzgl=10 i lp=290","rokwzgl=11 i lp=290","rokwzgl=12 i lp=290","rokwzgl=13 i lp=290","rokwzgl=14 i lp=290","rokwzgl=15 i lp=290","rokwzgl=16 i lp=290","rokwzgl=17 i lp=290","rokwzgl=18 i lp=290","rokwzgl=19 i lp=290","rokwzgl=20 i lp=290","rokwzgl=21 i lp=290","rokwzgl=22 i lp=290","rokwzgl=23 i lp=290","rokwzgl=24 i lp=290","rokwzgl=25 i lp=290","rokwzgl=26 i lp=290","rokwzgl=27 i lp=290","rokwzgl=28 i lp=290","rokwzgl=29 i lp=290"]
[300,5,"Rozchody budżetu","rokwzgl=0 i lp=300","rokwzgl=0 i lp=300","rokwzgl=1 i lp=300","rokwzgl=2 i lp=300","rokwzgl=3 i lp=300","rokwzgl=4 i lp=300","rokwzgl=5 i lp=300","rokwzgl=6 i lp=300","rokwzgl=7 i lp=300","rokwzgl=8 i lp=300","rokwzgl=9 i lp=300","rokwzgl=10 i lp=300","rokwzgl=11 i lp=300","rokwzgl=12 i lp=300","rokwzgl=13 i lp=300","rokwzgl=14 i lp=300","rokwzgl=15 i lp=300","rokwzgl=16 i lp=300","rokwzgl=17 i lp=300","rokwzgl=18 i lp=300","rokwzgl=19 i lp=300","rokwzgl=20 i lp=300","rokwzgl=21 i lp=300","rokwzgl=22 i lp=300","rokwzgl=23 i lp=300","rokwzgl=24 i lp=300","rokwzgl=25 i lp=300","rokwzgl=26 i lp=300","rokwzgl=27 i lp=300","rokwzgl=28 i lp=300","rokwzgl=29 i lp=300"]
[310,"5.1"," Spłaty rat kapitałowych kredytów i pożyczek oraz wykup papierów wartościowych","rokwzgl=0 i lp=310","rokwzgl=0 i lp=310","rokwzgl=1 i lp=310","rokwzgl=2 i lp=310","rokwzgl=3 i lp=310","rokwzgl=4 i lp=310","rokwzgl=5 i lp=310","rokwzgl=6 i lp=310","rokwzgl=7 i lp=310","rokwzgl=8 i lp=310","rokwzgl=9 i lp=310","rokwzgl=10 i lp=310","rokwzgl=11 i lp=310","rokwzgl=12 i lp=310","rokwzgl=13 i lp=310","rokwzgl=14 i lp=310","rokwzgl=15 i lp=310","rokwzgl=16 i lp=310","rokwzgl=17 i lp=310","rokwzgl=18 i lp=310","rokwzgl=19 i lp=310","rokwzgl=20 i lp=310","rokwzgl=21 i lp=310","rokwzgl=22 i lp=310","rokwzgl=23 i lp=310","rokwzgl=24 i lp=310","rokwzgl=25 i lp=310","rokwzgl=26 i lp=310","rokwzgl=27 i lp=310","rokwzgl=28 i lp=310","rokwzgl=29 i lp=310"]
[320,"5.1.1","  w tym łączna kwota przypadających na dany rok kwot ustawowych wyłączeń z limitu spłaty zobowiązań, o którym mowa w art. 243 ustawy, z tego:","rokwzgl=0 i lp=320","rokwzgl=0 i lp=320","rokwzgl=1 i lp=320","rokwzgl=2 i lp=320","rokwzgl=3 i lp=320","rokwzgl=4 i lp=320","rokwzgl=5 i lp=320","rokwzgl=6 i lp=320","rokwzgl=7 i lp=320","rokwzgl=8 i lp=320","rokwzgl=9 i lp=320","rokwzgl=10 i lp=320","rokwzgl=11 i lp=320","rokwzgl=12 i lp=320","rokwzgl=13 i lp=320","rokwzgl=14 i lp=320","rokwzgl=15 i lp=320","rokwzgl=16 i lp=320","rokwzgl=17 i lp=320","rokwzgl=18 i lp=320","rokwzgl=19 i lp=320","rokwzgl=20 i lp=320","rokwzgl=21 i lp=320","rokwzgl=22 i lp=320","rokwzgl=23 i lp=320","rokwzgl=24 i lp=320","rokwzgl=25 i lp=320","rokwzgl=26 i lp=320","rokwzgl=27 i lp=320","rokwzgl=28 i lp=320","rokwzgl=29 i lp=320"]
[332,"5.1.1.1","   kwota przypadających na dany rok kwot ustawowych wyłączeń określonych w art. 243 ust. 3 ustawy","rokwzgl=0 i lp=332","rokwzgl=0 i lp=332","rokwzgl=1 i lp=332","rokwzgl=2 i lp=332","rokwzgl=3 i lp=332","rokwzgl=4 i lp=332","rokwzgl=5 i lp=332","rokwzgl=6 i lp=332","rokwzgl=7 i lp=332","rokwzgl=8 i lp=332","rokwzgl=9 i lp=332","rokwzgl=10 i lp=332","rokwzgl=11 i lp=332","rokwzgl=12 i lp=332","rokwzgl=13 i lp=332","rokwzgl=14 i lp=332","rokwzgl=15 i lp=332","rokwzgl=16 i lp=332","rokwzgl=17 i lp=332","rokwzgl=18 i lp=332","rokwzgl=19 i lp=332","rokwzgl=20 i lp=332","rokwzgl=21 i lp=332","rokwzgl=22 i lp=332","rokwzgl=23 i lp=332","rokwzgl=24 i lp=332","rokwzgl=25 i lp=332","rokwzgl=26 i lp=332","rokwzgl=27 i lp=332","rokwzgl=28 i lp=332","rokwzgl=29 i lp=332"]
[334,"5.1.1.2","   kwota przypadających na dany rok kwot ustawowych wyłączeń określonych w art. 243 ust. 3a ustawy","rokwzgl=0 i lp=334","rokwzgl=0 i lp=334","rokwzgl=1 i lp=334","rokwzgl=2 i lp=334","rokwzgl=3 i lp=334","rokwzgl=4 i lp=334","rokwzgl=5 i lp=334","rokwzgl=6 i lp=334","rokwzgl=7 i lp=334","rokwzgl=8 i lp=334","rokwzgl=9 i lp=334","rokwzgl=10 i lp=334","rokwzgl=11 i lp=334","rokwzgl=12 i lp=334","rokwzgl=13 i lp=334","rokwzgl=14 i lp=334","rokwzgl=15 i lp=334","rokwzgl=16 i lp=334","rokwzgl=17 i lp=334","rokwzgl=18 i lp=334","rokwzgl=19 i lp=334","rokwzgl=20 i lp=334","rokwzgl=21 i lp=334","rokwzgl=22 i lp=334","rokwzgl=23 i lp=334","rokwzgl=24 i lp=334","rokwzgl=25 i lp=334","rokwzgl=26 i lp=334","rokwzgl=27 i lp=334","rokwzgl=28 i lp=334","rokwzgl=29 i lp=334"]
[336,"5.1.1.3","   kwota przypadających na dany rok kwot ustawowych wyłączeń innych niż określone w art. 243 ustawy",{"$f":"+\"rokwzgl=\"&D$9&\" i lp=\"&$A46","v":"rokwzgl=0 i lp=336"},"rokwzgl=0 i lp=336","rokwzgl=1 i lp=336","rokwzgl=2 i lp=336","rokwzgl=3 i lp=336","rokwzgl=4 i lp=336","rokwzgl=5 i lp=336","rokwzgl=6 i lp=336","rokwzgl=7 i lp=336","rokwzgl=8 i lp=336",{"$f":"+\"rokwzgl=\"&N$9&\" i lp=\"&$A46","v":"rokwzgl=9 i lp=336"},"rokwzgl=10 i lp=336","rokwzgl=11 i lp=336","rokwzgl=12 i lp=336","rokwzgl=13 i lp=336","rokwzgl=14 i lp=336","rokwzgl=15 i lp=336","rokwzgl=16 i lp=336","rokwzgl=17 i lp=336","rokwzgl=18 i lp=336",{"$f":"+\"rokwzgl=\"&X$9&\" i lp=\"&$A46","v":"rokwzgl=19 i lp=336"},"rokwzgl=20 i lp=336","rokwzgl=21 i lp=336","rokwzgl=22 i lp=336","rokwzgl=23 i lp=336","rokwzgl=24 i lp=336","rokwzgl=25 i lp=336","rokwzgl=26 i lp=336","rokwzgl=27 i lp=336","rokwzgl=28 i lp=336","rokwzgl=29 i lp=336"]
[340,"5.2"," Inne rozchody niezwiązane ze spłatą długu","rokwzgl=0 i lp=340","rokwzgl=0 i lp=340","rokwzgl=1 i lp=340","rokwzgl=2 i lp=340","rokwzgl=3 i lp=340","rokwzgl=4 i lp=340","rokwzgl=5 i lp=340","rokwzgl=6 i lp=340","rokwzgl=7 i lp=340","rokwzgl=8 i lp=340","rokwzgl=9 i lp=340","rokwzgl=10 i lp=340","rokwzgl=11 i lp=340","rokwzgl=12 i lp=340","rokwzgl=13 i lp=340","rokwzgl=14 i lp=340","rokwzgl=15 i lp=340","rokwzgl=16 i lp=340","rokwzgl=17 i lp=340","rokwzgl=18 i lp=340","rokwzgl=19 i lp=340","rokwzgl=20 i lp=340","rokwzgl=21 i lp=340","rokwzgl=22 i lp=340","rokwzgl=23 i lp=340","rokwzgl=24 i lp=340","rokwzgl=25 i lp=340","rokwzgl=26 i lp=340","rokwzgl=27 i lp=340","rokwzgl=28 i lp=340","rokwzgl=29 i lp=340"]
[350,6,"Kwota długu","rokwzgl=0 i lp=350","rokwzgl=0 i lp=350","rokwzgl=1 i lp=350","rokwzgl=2 i lp=350","rokwzgl=3 i lp=350","rokwzgl=4 i lp=350","rokwzgl=5 i lp=350","rokwzgl=6 i lp=350","rokwzgl=7 i lp=350","rokwzgl=8 i lp=350","rokwzgl=9 i lp=350","rokwzgl=10 i lp=350","rokwzgl=11 i lp=350","rokwzgl=12 i lp=350","rokwzgl=13 i lp=350","rokwzgl=14 i lp=350","rokwzgl=15 i lp=350","rokwzgl=16 i lp=350","rokwzgl=17 i lp=350","rokwzgl=18 i lp=350","rokwzgl=19 i lp=350","rokwzgl=20 i lp=350","rokwzgl=21 i lp=350","rokwzgl=22 i lp=350","rokwzgl=23 i lp=350","rokwzgl=24 i lp=350","rokwzgl=25 i lp=350","rokwzgl=26 i lp=350","rokwzgl=27 i lp=350","rokwzgl=28 i lp=350","rokwzgl=29 i lp=350"]
[400,7,"Kwota zobowiązań wynikających z przejęcia przez jednostkę samorządu terytorialnego zobowiązań po likwidowanych i przekształcanych jednostkach zaliczanych do sektora  finansów publicznych","rokwzgl=0 i lp=400","rokwzgl=0 i lp=400","rokwzgl=1 i lp=400","rokwzgl=2 i lp=400","rokwzgl=3 i lp=400","rokwzgl=4 i lp=400","rokwzgl=5 i lp=400","rokwzgl=6 i lp=400","rokwzgl=7 i lp=400","rokwzgl=8 i lp=400","rokwzgl=9 i lp=400","rokwzgl=10 i lp=400","rokwzgl=11 i lp=400","rokwzgl=12 i lp=400","rokwzgl=13 i lp=400","rokwzgl=14 i lp=400","rokwzgl=15 i lp=400","rokwzgl=16 i lp=400","rokwzgl=17 i lp=400","rokwzgl=18 i lp=400","rokwzgl=19 i lp=400","rokwzgl=20 i lp=400","rokwzgl=21 i lp=400","rokwzgl=22 i lp=400","rokwzgl=23 i lp=400","rokwzgl=24 i lp=400","rokwzgl=25 i lp=400","rokwzgl=26 i lp=400","rokwzgl=27 i lp=400","rokwzgl=28 i lp=400","rokwzgl=29 i lp=400"]
[410,8,"Relacja zrównoważenia wydatków bieżących, o której mowa w art. 242 ustawy","rokwzgl=0 i lp=410","rokwzgl=0 i lp=410","rokwzgl=1 i lp=410","rokwzgl=2 i lp=410","rokwzgl=3 i lp=410","rokwzgl=4 i lp=410","rokwzgl=5 i lp=410","rokwzgl=6 i lp=410","rokwzgl=7 i lp=410","rokwzgl=8 i lp=410","rokwzgl=9 i lp=410","rokwzgl=10 i lp=410","rokwzgl=11 i lp=410","rokwzgl=12 i lp=410","rokwzgl=13 i lp=410","rokwzgl=14 i lp=410","rokwzgl=15 i lp=410","rokwzgl=16 i lp=410","rokwzgl=17 i lp=410","rokwzgl=18 i lp=410","rokwzgl=19 i lp=410","rokwzgl=20 i lp=410","rokwzgl=21 i lp=410","rokwzgl=22 i lp=410","rokwzgl=23 i lp=410","rokwzgl=24 i lp=410","rokwzgl=25 i lp=410","rokwzgl=26 i lp=410","rokwzgl=27 i lp=410","rokwzgl=28 i lp=410","rokwzgl=29 i lp=410"]
[420,"8.1"," Różnica między dochodami bieżącymi a  wydatkami bieżącymi","rokwzgl=0 i lp=420","rokwzgl=0 i lp=420","rokwzgl=1 i lp=420","rokwzgl=2 i lp=420","rokwzgl=3 i lp=420","rokwzgl=4 i lp=420","rokwzgl=5 i lp=420","rokwzgl=6 i lp=420","rokwzgl=7 i lp=420","rokwzgl=8 i lp=420","rokwzgl=9 i lp=420","rokwzgl=10 i lp=420","rokwzgl=11 i lp=420","rokwzgl=12 i lp=420","rokwzgl=13 i lp=420","rokwzgl=14 i lp=420","rokwzgl=15 i lp=420","rokwzgl=16 i lp=420","rokwzgl=17 i lp=420","rokwzgl=18 i lp=420","rokwzgl=19 i lp=420","rokwzgl=20 i lp=420","rokwzgl=21 i lp=420","rokwzgl=22 i lp=420","rokwzgl=23 i lp=420","rokwzgl=24 i lp=420","rokwzgl=25 i lp=420","rokwzgl=26 i lp=420","rokwzgl=27 i lp=420","rokwzgl=28 i lp=420","rokwzgl=29 i lp=420"]
[430,"8.2"," Różnica między dochodami bieżącymi, skorygowanymi o środki a wydatkami bieżącymi, pomniejszonymi  o wydatki","rokwzgl=0 i lp=430","rokwzgl=0 i lp=430","rokwzgl=1 i lp=430","rokwzgl=2 i lp=430","rokwzgl=3 i lp=430","rokwzgl=4 i lp=430","rokwzgl=5 i lp=430","rokwzgl=6 i lp=430","rokwzgl=7 i lp=430","rokwzgl=8 i lp=430","rokwzgl=9 i lp=430","rokwzgl=10 i lp=430","rokwzgl=11 i lp=430","rokwzgl=12 i lp=430","rokwzgl=13 i lp=430","rokwzgl=14 i lp=430","rokwzgl=15 i lp=430","rokwzgl=16 i lp=430","rokwzgl=17 i lp=430","rokwzgl=18 i lp=430","rokwzgl=19 i lp=430","rokwzgl=20 i lp=430","rokwzgl=21 i lp=430","rokwzgl=22 i lp=430","rokwzgl=23 i lp=430","rokwzgl=24 i lp=430","rokwzgl=25 i lp=430","rokwzgl=26 i lp=430","rokwzgl=27 i lp=430","rokwzgl=28 i lp=430","rokwzgl=29 i lp=430"]
[440,9,"Wskaźnik spłaty zobowiązań","rokwzgl=0 i lp=440","rokwzgl=0 i lp=440","rokwzgl=1 i lp=440","rokwzgl=2 i lp=440","rokwzgl=3 i lp=440","rokwzgl=4 i lp=440","rokwzgl=5 i lp=440","rokwzgl=6 i lp=440","rokwzgl=7 i lp=440","rokwzgl=8 i lp=440","rokwzgl=9 i lp=440","rokwzgl=10 i lp=440","rokwzgl=11 i lp=440","rokwzgl=12 i lp=440","rokwzgl=13 i lp=440","rokwzgl=14 i lp=440","rokwzgl=15 i lp=440","rokwzgl=16 i lp=440","rokwzgl=17 i lp=440","rokwzgl=18 i lp=440","rokwzgl=19 i lp=440","rokwzgl=20 i lp=440","rokwzgl=21 i lp=440","rokwzgl=22 i lp=440","rokwzgl=23 i lp=440","rokwzgl=24 i lp=440","rokwzgl=25 i lp=440","rokwzgl=26 i lp=440","rokwzgl=27 i lp=440","rokwzgl=28 i lp=440","rokwzgl=29 i lp=440"]
[470,"9.1"," Wskaźnik planowanej łącznej kwoty spłaty zobowiązań, o której mowa w art. 243 ust. 1 ustawy do dochodów, bez uwzględnienia zobowiązań związku współtworzonego przez jednostkę samorządu terytorialnego  i bez uwzględnienia ustawowych wyłączeń przypadających na dany rok.","rokwzgl=0 i lp=470","rokwzgl=0 i lp=470","rokwzgl=1 i lp=470","rokwzgl=2 i lp=470","rokwzgl=3 i lp=470","rokwzgl=4 i lp=470","rokwzgl=5 i lp=470","rokwzgl=6 i lp=470","rokwzgl=7 i lp=470","rokwzgl=8 i lp=470","rokwzgl=9 i lp=470","rokwzgl=10 i lp=470","rokwzgl=11 i lp=470","rokwzgl=12 i lp=470","rokwzgl=13 i lp=470","rokwzgl=14 i lp=470","rokwzgl=15 i lp=470","rokwzgl=16 i lp=470","rokwzgl=17 i lp=470","rokwzgl=18 i lp=470","rokwzgl=19 i lp=470","rokwzgl=20 i lp=470","rokwzgl=21 i lp=470","rokwzgl=22 i lp=470","rokwzgl=23 i lp=470","rokwzgl=24 i lp=470","rokwzgl=25 i lp=470","rokwzgl=26 i lp=470","rokwzgl=27 i lp=470","rokwzgl=28 i lp=470","rokwzgl=29 i lp=470"]
[480,"9.2"," Wskaźnik planowanej łącznej kwoty spłaty zobowiązań, o której mowa w art. 243 ust. 1 ustawy do dochodów, bez uwzględnienia zobowiązań związku współtworzonego przez jednostkę samorządu terytorialnego, po uwzględnieniu ustawowych wyłączeń przypadających na dany rok.","rokwzgl=0 i lp=480","rokwzgl=0 i lp=480","rokwzgl=1 i lp=480","rokwzgl=2 i lp=480","rokwzgl=3 i lp=480","rokwzgl=4 i lp=480","rokwzgl=5 i lp=480","rokwzgl=6 i lp=480","rokwzgl=7 i lp=480","rokwzgl=8 i lp=480","rokwzgl=9 i lp=480","rokwzgl=10 i lp=480","rokwzgl=11 i lp=480","rokwzgl=12 i lp=480","rokwzgl=13 i lp=480","rokwzgl=14 i lp=480","rokwzgl=15 i lp=480","rokwzgl=16 i lp=480","rokwzgl=17 i lp=480","rokwzgl=18 i lp=480","rokwzgl=19 i lp=480","rokwzgl=20 i lp=480","rokwzgl=21 i lp=480","rokwzgl=22 i lp=480","rokwzgl=23 i lp=480","rokwzgl=24 i lp=480","rokwzgl=25 i lp=480","rokwzgl=26 i lp=480","rokwzgl=27 i lp=480","rokwzgl=28 i lp=480","rokwzgl=29 i lp=480"]
[490,"9.3"," Kwota zobowiązań związku współtworzonego przez jednostkę samorządu terytorialnego przypadających do spłaty w danym roku budżetowym, podlegająca doliczeniu zgodnie z art. 244 ustawy",{"$f":"+\"rokwzgl=\"&D$9&\" i lp=\"&$A56","v":"rokwzgl=0 i lp=490"},"rokwzgl=0 i lp=490","rokwzgl=1 i lp=490","rokwzgl=2 i lp=490","rokwzgl=3 i lp=490","rokwzgl=4 i lp=490","rokwzgl=5 i lp=490","rokwzgl=6 i lp=490","rokwzgl=7 i lp=490","rokwzgl=8 i lp=490",{"$f":"+\"rokwzgl=\"&N$9&\" i lp=\"&$A56","v":"rokwzgl=9 i lp=490"},"rokwzgl=10 i lp=490","rokwzgl=11 i lp=490","rokwzgl=12 i lp=490","rokwzgl=13 i lp=490","rokwzgl=14 i lp=490","rokwzgl=15 i lp=490","rokwzgl=16 i lp=490","rokwzgl=17 i lp=490","rokwzgl=18 i lp=490",{"$f":"+\"rokwzgl=\"&X$9&\" i lp=\"&$A56","v":"rokwzgl=19 i lp=490"},"rokwzgl=20 i lp=490","rokwzgl=21 i lp=490","rokwzgl=22 i lp=490","rokwzgl=23 i lp=490","rokwzgl=24 i lp=490","rokwzgl=25 i lp=490","rokwzgl=26 i lp=490","rokwzgl=27 i lp=490","rokwzgl=28 i lp=490","rokwzgl=29 i lp=490"]
[500,"9.4"," Wskaźnik planowanej łącznej kwoty spłaty zobowiązań, o której mowa w art. 243 ust. 1 ustawy do dochodów, po uwzględnieniu zobowiązań związku współtworzonego przez jednostkę samorządu terytorialnego oraz po uwzględnieniu ustawowych wyłączeń przypadających na dany rok","rokwzgl=0 i lp=500","rokwzgl=0 i lp=500","rokwzgl=1 i lp=500","rokwzgl=2 i lp=500","rokwzgl=3 i lp=500","rokwzgl=4 i lp=500","rokwzgl=5 i lp=500","rokwzgl=6 i lp=500","rokwzgl=7 i lp=500","rokwzgl=8 i lp=500","rokwzgl=9 i lp=500","rokwzgl=10 i lp=500","rokwzgl=11 i lp=500","rokwzgl=12 i lp=500","rokwzgl=13 i lp=500","rokwzgl=14 i lp=500","rokwzgl=15 i lp=500","rokwzgl=16 i lp=500","rokwzgl=17 i lp=500","rokwzgl=18 i lp=500","rokwzgl=19 i lp=500","rokwzgl=20 i lp=500","rokwzgl=21 i lp=500","rokwzgl=22 i lp=500","rokwzgl=23 i lp=500","rokwzgl=24 i lp=500","rokwzgl=25 i lp=500","rokwzgl=26 i lp=500","rokwzgl=27 i lp=500","rokwzgl=28 i lp=500","rokwzgl=29 i lp=500"]
[508,"9.5"," Wskaźnik dochodów bieżących powiększonych o dochody ze sprzedaży majątku oraz pomniejszonych o wydatki bieżące, do dochodów budżetu, ustalony dla danego roku (wskaźnik jednoroczny)","rokwzgl=0 i lp=508","rokwzgl=0 i lp=508","rokwzgl=1 i lp=508","rokwzgl=2 i lp=508","rokwzgl=3 i lp=508","rokwzgl=4 i lp=508","rokwzgl=5 i lp=508","rokwzgl=6 i lp=508","rokwzgl=7 i lp=508","rokwzgl=8 i lp=508","rokwzgl=9 i lp=508","rokwzgl=10 i lp=508","rokwzgl=11 i lp=508","rokwzgl=12 i lp=508","rokwzgl=13 i lp=508","rokwzgl=14 i lp=508","rokwzgl=15 i lp=508","rokwzgl=16 i lp=508","rokwzgl=17 i lp=508","rokwzgl=18 i lp=508","rokwzgl=19 i lp=508","rokwzgl=20 i lp=508","rokwzgl=21 i lp=508","rokwzgl=22 i lp=508","rokwzgl=23 i lp=508","rokwzgl=24 i lp=508","rokwzgl=25 i lp=508","rokwzgl=26 i lp=508","rokwzgl=27 i lp=508","rokwzgl=28 i lp=508","rokwzgl=29 i lp=508"]
[510,"9.6"," Dopuszczalny wskaźnik spłaty zobowiązań określony w art. 243 ustawy, po uwzględnieniu ustawowych wyłączeń , obliczony w oparciu o plan 3 kwartału roku poprzedzającego pierwszy rok prognozy (wskaźnik ustalony w oparciu o średnią arytmetyczną z 3 poprzednich lat) ","rokwzgl=0 i lp=510","rokwzgl=0 i lp=510","rokwzgl=1 i lp=510","rokwzgl=2 i lp=510","rokwzgl=3 i lp=510","rokwzgl=4 i lp=510","rokwzgl=5 i lp=510","rokwzgl=6 i lp=510","rokwzgl=7 i lp=510","rokwzgl=8 i lp=510","rokwzgl=9 i lp=510","rokwzgl=10 i lp=510","rokwzgl=11 i lp=510","rokwzgl=12 i lp=510","rokwzgl=13 i lp=510","rokwzgl=14 i lp=510","rokwzgl=15 i lp=510","rokwzgl=16 i lp=510","rokwzgl=17 i lp=510","rokwzgl=18 i lp=510","rokwzgl=19 i lp=510","rokwzgl=20 i lp=510","rokwzgl=21 i lp=510","rokwzgl=22 i lp=510","rokwzgl=23 i lp=510","rokwzgl=24 i lp=510","rokwzgl=25 i lp=510","rokwzgl=26 i lp=510","rokwzgl=27 i lp=510","rokwzgl=28 i lp=510","rokwzgl=29 i lp=510"]
[520,"9.6.1","   Dopuszczalny wskaźnik spłaty zobowiązań określony w art. 243 ustawy, po uwzględnieniu ustawowych wyłączeń, obliczony w oparciu o wykonanie roku poprzedzającego pierwszy rok prognozy (wskaźnik ustalony w oparciu o średnią arytmetyczną z 3 poprzednich lat) ","rokwzgl=0 i lp=520","rokwzgl=0 i lp=520","rokwzgl=1 i lp=520","rokwzgl=2 i lp=520","rokwzgl=3 i lp=520","rokwzgl=4 i lp=520","rokwzgl=5 i lp=520","rokwzgl=6 i lp=520","rokwzgl=7 i lp=520","rokwzgl=8 i lp=520","rokwzgl=9 i lp=520","rokwzgl=10 i lp=520","rokwzgl=11 i lp=520","rokwzgl=12 i lp=520","rokwzgl=13 i lp=520","rokwzgl=14 i lp=520","rokwzgl=15 i lp=520","rokwzgl=16 i lp=520","rokwzgl=17 i lp=520","rokwzgl=18 i lp=520","rokwzgl=19 i lp=520","rokwzgl=20 i lp=520","rokwzgl=21 i lp=520","rokwzgl=22 i lp=520","rokwzgl=23 i lp=520","rokwzgl=24 i lp=520","rokwzgl=25 i lp=520","rokwzgl=26 i lp=520","rokwzgl=27 i lp=520","rokwzgl=28 i lp=520","rokwzgl=29 i lp=520"]
[530,"9.7"," Informacja o spełnieniu wskaźnika spłaty zobowiązań określonego w art. 243 ustawy, po uwzględnieniu zobowiązań związku współtworzonego przez jednostkę samorządu terytorialnego oraz po uwzględnieniu ustawowych wyłączeń, obliczonego w oparciu o plan 3 kwartałów roku poprzedzającego rok budżetowy","rokwzgl=0 i lp=530","rokwzgl=0 i lp=530","rokwzgl=1 i lp=530","rokwzgl=2 i lp=530","rokwzgl=3 i lp=530","rokwzgl=4 i lp=530","rokwzgl=5 i lp=530","rokwzgl=6 i lp=530","rokwzgl=7 i lp=530","rokwzgl=8 i lp=530","rokwzgl=9 i lp=530","rokwzgl=10 i lp=530","rokwzgl=11 i lp=530","rokwzgl=12 i lp=530","rokwzgl=13 i lp=530","rokwzgl=14 i lp=530","rokwzgl=15 i lp=530","rokwzgl=16 i lp=530","rokwzgl=17 i lp=530","rokwzgl=18 i lp=530","rokwzgl=19 i lp=530","rokwzgl=20 i lp=530","rokwzgl=21 i lp=530","rokwzgl=22 i lp=530","rokwzgl=23 i lp=530","rokwzgl=24 i lp=530","rokwzgl=25 i lp=530","rokwzgl=26 i lp=530","rokwzgl=27 i lp=530","rokwzgl=28 i lp=530","rokwzgl=29 i lp=530"]
[540,"9.7.1","  Informacja o spełnieniu wskaźnika spłaty zobowiązań określonego w art. 243 ustawy, po uwzględnieniu zobowiązań związku współtworzonego przez jednostkę samorządu terytorialnego oraz po uwzględnieniu ustawowych wyłączeń, obliczonego w oparciu o wykonanie roku poprzedzającego rok budżetowy","rokwzgl=0 i lp=540","rokwzgl=0 i lp=540","rokwzgl=1 i lp=540","rokwzgl=2 i lp=540","rokwzgl=3 i lp=540","rokwzgl=4 i lp=540","rokwzgl=5 i lp=540","rokwzgl=6 i lp=540","rokwzgl=7 i lp=540","rokwzgl=8 i lp=540","rokwzgl=9 i lp=540","rokwzgl=10 i lp=540","rokwzgl=11 i lp=540","rokwzgl=12 i lp=540","rokwzgl=13 i lp=540","rokwzgl=14 i lp=540","rokwzgl=15 i lp=540","rokwzgl=16 i lp=540","rokwzgl=17 i lp=540","rokwzgl=18 i lp=540","rokwzgl=19 i lp=540","rokwzgl=20 i lp=540","rokwzgl=21 i lp=540","rokwzgl=22 i lp=540","rokwzgl=23 i lp=540","rokwzgl=24 i lp=540","rokwzgl=25 i lp=540","rokwzgl=26 i lp=540","rokwzgl=27 i lp=540","rokwzgl=28 i lp=540","rokwzgl=29 i lp=540"]
[550,10,"Przeznaczenie prognozowanej nadwyżki budżetowej,  w tym na:","rokwzgl=0 i lp=550","rokwzgl=0 i lp=550","rokwzgl=1 i lp=550","rokwzgl=2 i lp=550","rokwzgl=3 i lp=550","rokwzgl=4 i lp=550","rokwzgl=5 i lp=550","rokwzgl=6 i lp=550","rokwzgl=7 i lp=550","rokwzgl=8 i lp=550","rokwzgl=9 i lp=550","rokwzgl=10 i lp=550","rokwzgl=11 i lp=550","rokwzgl=12 i lp=550","rokwzgl=13 i lp=550","rokwzgl=14 i lp=550","rokwzgl=15 i lp=550","rokwzgl=16 i lp=550","rokwzgl=17 i lp=550","rokwzgl=18 i lp=550","rokwzgl=19 i lp=550","rokwzgl=20 i lp=550","rokwzgl=21 i lp=550","rokwzgl=22 i lp=550","rokwzgl=23 i lp=550","rokwzgl=24 i lp=550","rokwzgl=25 i lp=550","rokwzgl=26 i lp=550","rokwzgl=27 i lp=550","rokwzgl=28 i lp=550","rokwzgl=29 i lp=550"]
[560,"10.1"," Spłaty kredytów, pożyczek i wykup papierów wartościowych","rokwzgl=0 i lp=560","rokwzgl=0 i lp=560","rokwzgl=1 i lp=560","rokwzgl=2 i lp=560","rokwzgl=3 i lp=560","rokwzgl=4 i lp=560","rokwzgl=5 i lp=560","rokwzgl=6 i lp=560","rokwzgl=7 i lp=560","rokwzgl=8 i lp=560","rokwzgl=9 i lp=560","rokwzgl=10 i lp=560","rokwzgl=11 i lp=560","rokwzgl=12 i lp=560","rokwzgl=13 i lp=560","rokwzgl=14 i lp=560","rokwzgl=15 i lp=560","rokwzgl=16 i lp=560","rokwzgl=17 i lp=560","rokwzgl=18 i lp=560","rokwzgl=19 i lp=560","rokwzgl=20 i lp=560","rokwzgl=21 i lp=560","rokwzgl=22 i lp=560","rokwzgl=23 i lp=560","rokwzgl=24 i lp=560","rokwzgl=25 i lp=560","rokwzgl=26 i lp=560","rokwzgl=27 i lp=560","rokwzgl=28 i lp=560","rokwzgl=29 i lp=560"]
[570,11,"Informacje uzupełniające o wybranych rodzajach wydatków budżetowych","rokwzgl=0 i lp=570","rokwzgl=0 i lp=570","rokwzgl=1 i lp=570","rokwzgl=2 i lp=570","rokwzgl=3 i lp=570","rokwzgl=4 i lp=570","rokwzgl=5 i lp=570","rokwzgl=6 i lp=570","rokwzgl=7 i lp=570","rokwzgl=8 i lp=570","rokwzgl=9 i lp=570","rokwzgl=10 i lp=570","rokwzgl=11 i lp=570","rokwzgl=12 i lp=570","rokwzgl=13 i lp=570","rokwzgl=14 i lp=570","rokwzgl=15 i lp=570","rokwzgl=16 i lp=570","rokwzgl=17 i lp=570","rokwzgl=18 i lp=570","rokwzgl=19 i lp=570","rokwzgl=20 i lp=570","rokwzgl=21 i lp=570","rokwzgl=22 i lp=570","rokwzgl=23 i lp=570","rokwzgl=24 i lp=570","rokwzgl=25 i lp=570","rokwzgl=26 i lp=570","rokwzgl=27 i lp=570","rokwzgl=28 i lp=570","rokwzgl=29 i lp=570"]
[580,"11.1"," Wydatki bieżące na wynagrodzenia i składki od nich naliczane",{"$f":"+\"rokwzgl=\"&D$9&\" i lp=\"&$A66","v":"rokwzgl=0 i lp=580"},"rokwzgl=0 i lp=580","rokwzgl=1 i lp=580","rokwzgl=2 i lp=580","rokwzgl=3 i lp=580","rokwzgl=4 i lp=580","rokwzgl=5 i lp=580","rokwzgl=6 i lp=580","rokwzgl=7 i lp=580","rokwzgl=8 i lp=580",{"$f":"+\"rokwzgl=\"&N$9&\" i lp=\"&$A66","v":"rokwzgl=9 i lp=580"},"rokwzgl=10 i lp=580","rokwzgl=11 i lp=580","rokwzgl=12 i lp=580","rokwzgl=13 i lp=580","rokwzgl=14 i lp=580","rokwzgl=15 i lp=580","rokwzgl=16 i lp=580","rokwzgl=17 i lp=580","rokwzgl=18 i lp=580",{"$f":"+\"rokwzgl=\"&X$9&\" i lp=\"&$A66","v":"rokwzgl=19 i lp=580"},"rokwzgl=20 i lp=580","rokwzgl=21 i lp=580","rokwzgl=22 i lp=580","rokwzgl=23 i lp=580","rokwzgl=24 i lp=580","rokwzgl=25 i lp=580","rokwzgl=26 i lp=580","rokwzgl=27 i lp=580","rokwzgl=28 i lp=580","rokwzgl=29 i lp=580"]
[590,"11.2"," Wydatki związane z funkcjonowaniem organów jednostki samorządu terytorialnego","rokwzgl=0 i lp=590","rokwzgl=0 i lp=590","rokwzgl=1 i lp=590","rokwzgl=2 i lp=590","rokwzgl=3 i lp=590","rokwzgl=4 i lp=590","rokwzgl=5 i lp=590","rokwzgl=6 i lp=590","rokwzgl=7 i lp=590","rokwzgl=8 i lp=590","rokwzgl=9 i lp=590","rokwzgl=10 i lp=590","rokwzgl=11 i lp=590","rokwzgl=12 i lp=590","rokwzgl=13 i lp=590","rokwzgl=14 i lp=590","rokwzgl=15 i lp=590","rokwzgl=16 i lp=590","rokwzgl=17 i lp=590","rokwzgl=18 i lp=590","rokwzgl=19 i lp=590","rokwzgl=20 i lp=590","rokwzgl=21 i lp=590","rokwzgl=22 i lp=590","rokwzgl=23 i lp=590","rokwzgl=24 i lp=590","rokwzgl=25 i lp=590","rokwzgl=26 i lp=590","rokwzgl=27 i lp=590","rokwzgl=28 i lp=590","rokwzgl=29 i lp=590"]
[600,"11.3"," Wydatki objęte limitem, o którym mowa w art. 226 ust. 3 pkt 4 ustawy","rokwzgl=0 i lp=600","rokwzgl=0 i lp=600","rokwzgl=1 i lp=600","rokwzgl=2 i lp=600","rokwzgl=3 i lp=600","rokwzgl=4 i lp=600","rokwzgl=5 i lp=600","rokwzgl=6 i lp=600","rokwzgl=7 i lp=600","rokwzgl=8 i lp=600","rokwzgl=9 i lp=600","rokwzgl=10 i lp=600","rokwzgl=11 i lp=600","rokwzgl=12 i lp=600","rokwzgl=13 i lp=600","rokwzgl=14 i lp=600","rokwzgl=15 i lp=600","rokwzgl=16 i lp=600","rokwzgl=17 i lp=600","rokwzgl=18 i lp=600","rokwzgl=19 i lp=600","rokwzgl=20 i lp=600","rokwzgl=21 i lp=600","rokwzgl=22 i lp=600","rokwzgl=23 i lp=600","rokwzgl=24 i lp=600","rokwzgl=25 i lp=600","rokwzgl=26 i lp=600","rokwzgl=27 i lp=600","rokwzgl=28 i lp=600","rokwzgl=29 i lp=600"]
[610,"11.3.1","   bieżące","rokwzgl=0 i lp=610","rokwzgl=0 i lp=610","rokwzgl=1 i lp=610","rokwzgl=2 i lp=610","rokwzgl=3 i lp=610","rokwzgl=4 i lp=610","rokwzgl=5 i lp=610","rokwzgl=6 i lp=610","rokwzgl=7 i lp=610","rokwzgl=8 i lp=610","rokwzgl=9 i lp=610","rokwzgl=10 i lp=610","rokwzgl=11 i lp=610","rokwzgl=12 i lp=610","rokwzgl=13 i lp=610","rokwzgl=14 i lp=610","rokwzgl=15 i lp=610","rokwzgl=16 i lp=610","rokwzgl=17 i lp=610","rokwzgl=18 i lp=610","rokwzgl=19 i lp=610","rokwzgl=20 i lp=610","rokwzgl=21 i lp=610","rokwzgl=22 i lp=610","rokwzgl=23 i lp=610","rokwzgl=24 i lp=610","rokwzgl=25 i lp=610","rokwzgl=26 i lp=610","rokwzgl=27 i lp=610","rokwzgl=28 i lp=610","rokwzgl=29 i lp=610"]
[620,"11.3.2","   majątkowe","rokwzgl=0 i lp=620","rokwzgl=0 i lp=620","rokwzgl=1 i lp=620","rokwzgl=2 i lp=620","rokwzgl=3 i lp=620","rokwzgl=4 i lp=620","rokwzgl=5 i lp=620","rokwzgl=6 i lp=620","rokwzgl=7 i lp=620","rokwzgl=8 i lp=620","rokwzgl=9 i lp=620","rokwzgl=10 i lp=620","rokwzgl=11 i lp=620","rokwzgl=12 i lp=620","rokwzgl=13 i lp=620","rokwzgl=14 i lp=620","rokwzgl=15 i lp=620","rokwzgl=16 i lp=620","rokwzgl=17 i lp=620","rokwzgl=18 i lp=620","rokwzgl=19 i lp=620","rokwzgl=20 i lp=620","rokwzgl=21 i lp=620","rokwzgl=22 i lp=620","rokwzgl=23 i lp=620","rokwzgl=24 i lp=620","rokwzgl=25 i lp=620","rokwzgl=26 i lp=620","rokwzgl=27 i lp=620","rokwzgl=28 i lp=620","rokwzgl=29 i lp=620"]
[630,"11.4"," Wydatki inwestycyjne kontynuowane ","rokwzgl=0 i lp=630","rokwzgl=0 i lp=630","rokwzgl=1 i lp=630","rokwzgl=2 i lp=630","rokwzgl=3 i lp=630","rokwzgl=4 i lp=630","rokwzgl=5 i lp=630","rokwzgl=6 i lp=630","rokwzgl=7 i lp=630","rokwzgl=8 i lp=630","rokwzgl=9 i lp=630","rokwzgl=10 i lp=630","rokwzgl=11 i lp=630","rokwzgl=12 i lp=630","rokwzgl=13 i lp=630","rokwzgl=14 i lp=630","rokwzgl=15 i lp=630","rokwzgl=16 i lp=630","rokwzgl=17 i lp=630","rokwzgl=18 i lp=630","rokwzgl=19 i lp=630","rokwzgl=20 i lp=630","rokwzgl=21 i lp=630","rokwzgl=22 i lp=630","rokwzgl=23 i lp=630","rokwzgl=24 i lp=630","rokwzgl=25 i lp=630","rokwzgl=26 i lp=630","rokwzgl=27 i lp=630","rokwzgl=28 i lp=630","rokwzgl=29 i lp=630"]
[640,"11.5"," Nowe wydatki inwestycyjne","rokwzgl=0 i lp=640","rokwzgl=0 i lp=640","rokwzgl=1 i lp=640","rokwzgl=2 i lp=640","rokwzgl=3 i lp=640","rokwzgl=4 i lp=640","rokwzgl=5 i lp=640","rokwzgl=6 i lp=640","rokwzgl=7 i lp=640","rokwzgl=8 i lp=640","rokwzgl=9 i lp=640","rokwzgl=10 i lp=640","rokwzgl=11 i lp=640","rokwzgl=12 i lp=640","rokwzgl=13 i lp=640","rokwzgl=14 i lp=640","rokwzgl=15 i lp=640","rokwzgl=16 i lp=640","rokwzgl=17 i lp=640","rokwzgl=18 i lp=640","rokwzgl=19 i lp=640","rokwzgl=20 i lp=640","rokwzgl=21 i lp=640","rokwzgl=22 i lp=640","rokwzgl=23 i lp=640","rokwzgl=24 i lp=640","rokwzgl=25 i lp=640","rokwzgl=26 i lp=640","rokwzgl=27 i lp=640","rokwzgl=28 i lp=640","rokwzgl=29 i lp=640"]
[650,"11.6"," Wydatki majątkowe w formie dotacji ","rokwzgl=0 i lp=650","rokwzgl=0 i lp=650","rokwzgl=1 i lp=650","rokwzgl=2 i lp=650","rokwzgl=3 i lp=650","rokwzgl=4 i lp=650","rokwzgl=5 i lp=650","rokwzgl=6 i lp=650","rokwzgl=7 i lp=650","rokwzgl=8 i lp=650","rokwzgl=9 i lp=650","rokwzgl=10 i lp=650","rokwzgl=11 i lp=650","rokwzgl=12 i lp=650","rokwzgl=13 i lp=650","rokwzgl=14 i lp=650","rokwzgl=15 i lp=650","rokwzgl=16 i lp=650","rokwzgl=17 i lp=650","rokwzgl=18 i lp=650","rokwzgl=19 i lp=650","rokwzgl=20 i lp=650","rokwzgl=21 i lp=650","rokwzgl=22 i lp=650","rokwzgl=23 i lp=650","rokwzgl=24 i lp=650","rokwzgl=25 i lp=650","rokwzgl=26 i lp=650","rokwzgl=27 i lp=650","rokwzgl=28 i lp=650","rokwzgl=29 i lp=650"]
[660,12,"Finansowanie programów, projektów lub zadań realizowanych z udziałem środków, o których mowa w art. 5 ust. 1 pkt 2 i 3 ustawy","rokwzgl=0 i lp=660","rokwzgl=0 i lp=660","rokwzgl=1 i lp=660","rokwzgl=2 i lp=660","rokwzgl=3 i lp=660","rokwzgl=4 i lp=660","rokwzgl=5 i lp=660","rokwzgl=6 i lp=660","rokwzgl=7 i lp=660","rokwzgl=8 i lp=660","rokwzgl=9 i lp=660","rokwzgl=10 i lp=660","rokwzgl=11 i lp=660","rokwzgl=12 i lp=660","rokwzgl=13 i lp=660","rokwzgl=14 i lp=660","rokwzgl=15 i lp=660","rokwzgl=16 i lp=660","rokwzgl=17 i lp=660","rokwzgl=18 i lp=660","rokwzgl=19 i lp=660","rokwzgl=20 i lp=660","rokwzgl=21 i lp=660","rokwzgl=22 i lp=660","rokwzgl=23 i lp=660","rokwzgl=24 i lp=660","rokwzgl=25 i lp=660","rokwzgl=26 i lp=660","rokwzgl=27 i lp=660","rokwzgl=28 i lp=660","rokwzgl=29 i lp=660"]
[670,"12.1"," Dochody bieżące  na programy, projekty lub zadania finansowane z udziałem środków, o których mowa w art. 5 ust. 1 pkt 2 i 3 ustawy","rokwzgl=0 i lp=670","rokwzgl=0 i lp=670","rokwzgl=1 i lp=670","rokwzgl=2 i lp=670","rokwzgl=3 i lp=670","rokwzgl=4 i lp=670","rokwzgl=5 i lp=670","rokwzgl=6 i lp=670","rokwzgl=7 i lp=670","rokwzgl=8 i lp=670","rokwzgl=9 i lp=670","rokwzgl=10 i lp=670","rokwzgl=11 i lp=670","rokwzgl=12 i lp=670","rokwzgl=13 i lp=670","rokwzgl=14 i lp=670","rokwzgl=15 i lp=670","rokwzgl=16 i lp=670","rokwzgl=17 i lp=670","rokwzgl=18 i lp=670","rokwzgl=19 i lp=670","rokwzgl=20 i lp=670","rokwzgl=21 i lp=670","rokwzgl=22 i lp=670","rokwzgl=23 i lp=670","rokwzgl=24 i lp=670","rokwzgl=25 i lp=670","rokwzgl=26 i lp=670","rokwzgl=27 i lp=670","rokwzgl=28 i lp=670","rokwzgl=29 i lp=670"]
[680,"12.1.1","  -  w tym środki określone w art. 5 ust. 1 pkt 2 ustawy",{"$f":"+\"rokwzgl=\"&D$9&\" i lp=\"&$A76","v":"rokwzgl=0 i lp=680"},"rokwzgl=0 i lp=680","rokwzgl=1 i lp=680","rokwzgl=2 i lp=680","rokwzgl=3 i lp=680","rokwzgl=4 i lp=680","rokwzgl=5 i lp=680","rokwzgl=6 i lp=680","rokwzgl=7 i lp=680","rokwzgl=8 i lp=680","rokwzgl=9 i lp=680","rokwzgl=10 i lp=680","rokwzgl=11 i lp=680","rokwzgl=12 i lp=680","rokwzgl=13 i lp=680","rokwzgl=14 i lp=680","rokwzgl=15 i lp=680","rokwzgl=16 i lp=680","rokwzgl=17 i lp=680","rokwzgl=18 i lp=680","rokwzgl=19 i lp=680","rokwzgl=20 i lp=680","rokwzgl=21 i lp=680","rokwzgl=22 i lp=680","rokwzgl=23 i lp=680","rokwzgl=24 i lp=680","rokwzgl=25 i lp=680","rokwzgl=26 i lp=680","rokwzgl=27 i lp=680","rokwzgl=28 i lp=680",{"$f":"+\"rokwzgl=\"&AH$9&\" i lp=\"&$A76","v":"rokwzgl=29 i lp=680"}]
[690,"12.1.1.1","   - w tym środki określone w art. 5 ust. 1 pkt 2 ustawy wynikające wyłącznie z  zawartych umów na realizację programu, projektu lub zadania",{"$f":"+\"rokwzgl=\"&D$9&\" i lp=\"&$A77","v":"rokwzgl=0 i lp=690"},{"$f":"+\"rokwzgl=\"&E$9&\" i lp=\"&$A77","v":"rokwzgl=0 i lp=690"},{"$f":"+\"rokwzgl=\"&F$9&\" i lp=\"&$A77","v":"rokwzgl=1 i lp=690"},{"$f":"+\"rokwzgl=\"&G$9&\" i lp=\"&$A77","v":"rokwzgl=2 i lp=690"},{"$f":"+\"rokwzgl=\"&H$9&\" i lp=\"&$A77","v":"rokwzgl=3 i lp=690"},{"$f":"+\"rokwzgl=\"&I$9&\" i lp=\"&$A77","v":"rokwzgl=4 i lp=690"},"rokwzgl=5 i lp=690","rokwzgl=6 i lp=690","rokwzgl=7 i lp=690","rokwzgl=8 i lp=690","rokwzgl=9 i lp=690","rokwzgl=10 i lp=690","rokwzgl=11 i lp=690","rokwzgl=12 i lp=690","rokwzgl=13 i lp=690","rokwzgl=14 i lp=690","rokwzgl=15 i lp=690","rokwzgl=16 i lp=690","rokwzgl=17 i lp=690","rokwzgl=18 i lp=690","rokwzgl=19 i lp=690","rokwzgl=20 i lp=690","rokwzgl=21 i lp=690","rokwzgl=22 i lp=690","rokwzgl=23 i lp=690","rokwzgl=24 i lp=690","rokwzgl=25 i lp=690","rokwzgl=26 i lp=690","rokwzgl=27 i lp=690","rokwzgl=28 i lp=690","rokwzgl=29 i lp=690"]
[700,"12.2"," Dochody majątkowe  na programy, projekty lub zadania finansowane z udziałem środków, o których mowa w art. 5 ust. 1 pkt 2 i 3 ustawy",{"$f":"+\"rokwzgl=\"&D$9&\" i lp=\"&$A78","v":"rokwzgl=0 i lp=700"},"rokwzgl=0 i lp=700","rokwzgl=1 i lp=700","rokwzgl=2 i lp=700","rokwzgl=3 i lp=700","rokwzgl=4 i lp=700","rokwzgl=5 i lp=700","rokwzgl=6 i lp=700","rokwzgl=7 i lp=700","rokwzgl=8 i lp=700","rokwzgl=9 i lp=700","rokwzgl=10 i lp=700","rokwzgl=11 i lp=700","rokwzgl=12 i lp=700","rokwzgl=13 i lp=700","rokwzgl=14 i lp=700","rokwzgl=15 i lp=700","rokwzgl=16 i lp=700","rokwzgl=17 i lp=700","rokwzgl=18 i lp=700","rokwzgl=19 i lp=700","rokwzgl=20 i lp=700","rokwzgl=21 i lp=700","rokwzgl=22 i lp=700","rokwzgl=23 i lp=700","rokwzgl=24 i lp=700","rokwzgl=25 i lp=700","rokwzgl=26 i lp=700","rokwzgl=27 i lp=700","rokwzgl=28 i lp=700","rokwzgl=29 i lp=700"]
[710,"12.2.1","   -  w tym środki określone w art. 5 ust. 1 pkt 2 ustawy","rokwzgl=0 i lp=710","rokwzgl=0 i lp=710","rokwzgl=1 i lp=710","rokwzgl=2 i lp=710","rokwzgl=3 i lp=710","rokwzgl=4 i lp=710","rokwzgl=5 i lp=710","rokwzgl=6 i lp=710","rokwzgl=7 i lp=710","rokwzgl=8 i lp=710","rokwzgl=9 i lp=710","rokwzgl=10 i lp=710","rokwzgl=11 i lp=710","rokwzgl=12 i lp=710","rokwzgl=13 i lp=710","rokwzgl=14 i lp=710","rokwzgl=15 i lp=710","rokwzgl=16 i lp=710","rokwzgl=17 i lp=710","rokwzgl=18 i lp=710","rokwzgl=19 i lp=710","rokwzgl=20 i lp=710","rokwzgl=21 i lp=710","rokwzgl=22 i lp=710","rokwzgl=23 i lp=710","rokwzgl=24 i lp=710","rokwzgl=25 i lp=710","rokwzgl=26 i lp=710","rokwzgl=27 i lp=710","rokwzgl=28 i lp=710","rokwzgl=29 i lp=710"]
[720,"12.2.1.1","    - w tym środki określone w art. 5 ust. 1 pkt 2 ustawy wynikające wyłącznie z zawartych umów na realizację programu, projektu lub zadania","rokwzgl=0 i lp=720","rokwzgl=0 i lp=720","rokwzgl=1 i lp=720","rokwzgl=2 i lp=720","rokwzgl=3 i lp=720","rokwzgl=4 i lp=720","rokwzgl=5 i lp=720","rokwzgl=6 i lp=720","rokwzgl=7 i lp=720","rokwzgl=8 i lp=720","rokwzgl=9 i lp=720","rokwzgl=10 i lp=720","rokwzgl=11 i lp=720","rokwzgl=12 i lp=720","rokwzgl=13 i lp=720","rokwzgl=14 i lp=720","rokwzgl=15 i lp=720","rokwzgl=16 i lp=720","rokwzgl=17 i lp=720","rokwzgl=18 i lp=720","rokwzgl=19 i lp=720","rokwzgl=20 i lp=720","rokwzgl=21 i lp=720","rokwzgl=22 i lp=720","rokwzgl=23 i lp=720","rokwzgl=24 i lp=720","rokwzgl=25 i lp=720","rokwzgl=26 i lp=720","rokwzgl=27 i lp=720","rokwzgl=28 i lp=720","rokwzgl=29 i lp=720"]
[730,"12.3"," Wydatki bieżące na programy, projekty lub zadania finansowane z udziałem środków, o których mowa w art. 5 ust. 1 pkt 2 i 3 ustawy","rokwzgl=0 i lp=730","rokwzgl=0 i lp=730","rokwzgl=1 i lp=730","rokwzgl=2 i lp=730","rokwzgl=3 i lp=730","rokwzgl=4 i lp=730","rokwzgl=5 i lp=730","rokwzgl=6 i lp=730","rokwzgl=7 i lp=730","rokwzgl=8 i lp=730","rokwzgl=9 i lp=730","rokwzgl=10 i lp=730","rokwzgl=11 i lp=730","rokwzgl=12 i lp=730","rokwzgl=13 i lp=730","rokwzgl=14 i lp=730","rokwzgl=15 i lp=730","rokwzgl=16 i lp=730","rokwzgl=17 i lp=730","rokwzgl=18 i lp=730","rokwzgl=19 i lp=730","rokwzgl=20 i lp=730","rokwzgl=21 i lp=730","rokwzgl=22 i lp=730","rokwzgl=23 i lp=730","rokwzgl=24 i lp=730","rokwzgl=25 i lp=730","rokwzgl=26 i lp=730","rokwzgl=27 i lp=730","rokwzgl=28 i lp=730","rokwzgl=29 i lp=730"]
[740,"12.3.1","  -  w tym finansowane środkami określonymi w art. 5 ust. 1 pkt 2 ustawy ","rokwzgl=0 i lp=740","rokwzgl=0 i lp=740","rokwzgl=1 i lp=740","rokwzgl=2 i lp=740","rokwzgl=3 i lp=740","rokwzgl=4 i lp=740","rokwzgl=5 i lp=740","rokwzgl=6 i lp=740","rokwzgl=7 i lp=740","rokwzgl=8 i lp=740","rokwzgl=9 i lp=740","rokwzgl=10 i lp=740","rokwzgl=11 i lp=740","rokwzgl=12 i lp=740","rokwzgl=13 i lp=740","rokwzgl=14 i lp=740","rokwzgl=15 i lp=740","rokwzgl=16 i lp=740","rokwzgl=17 i lp=740","rokwzgl=18 i lp=740","rokwzgl=19 i lp=740","rokwzgl=20 i lp=740","rokwzgl=21 i lp=740","rokwzgl=22 i lp=740","rokwzgl=23 i lp=740","rokwzgl=24 i lp=740","rokwzgl=25 i lp=740","rokwzgl=26 i lp=740","rokwzgl=27 i lp=740","rokwzgl=28 i lp=740","rokwzgl=29 i lp=740"]
[750,"12.3.2","  Wydatki bieżące na realizację programu, projektu lub zadania wynikające wyłącznie z zawartych umów z podmiotem dysponującym środkami, o których mowa w art. 5 ust. 1 pkt 2 ustawy ","rokwzgl=0 i lp=750","rokwzgl=0 i lp=750","rokwzgl=1 i lp=750","rokwzgl=2 i lp=750","rokwzgl=3 i lp=750","rokwzgl=4 i lp=750","rokwzgl=5 i lp=750","rokwzgl=6 i lp=750","rokwzgl=7 i lp=750","rokwzgl=8 i lp=750","rokwzgl=9 i lp=750","rokwzgl=10 i lp=750","rokwzgl=11 i lp=750","rokwzgl=12 i lp=750","rokwzgl=13 i lp=750","rokwzgl=14 i lp=750","rokwzgl=15 i lp=750","rokwzgl=16 i lp=750","rokwzgl=17 i lp=750","rokwzgl=18 i lp=750","rokwzgl=19 i lp=750","rokwzgl=20 i lp=750","rokwzgl=21 i lp=750","rokwzgl=22 i lp=750","rokwzgl=23 i lp=750","rokwzgl=24 i lp=750","rokwzgl=25 i lp=750","rokwzgl=26 i lp=750","rokwzgl=27 i lp=750","rokwzgl=28 i lp=750","rokwzgl=29 i lp=750"]
[760,"12.4"," Wydatki majątkowe na programy, projekty lub zadania finansowane z udziałem środków, o których mowa w art. 5 ust. 1 pkt 2 i 3 ustawy","rokwzgl=0 i lp=760","rokwzgl=0 i lp=760","rokwzgl=1 i lp=760","rokwzgl=2 i lp=760","rokwzgl=3 i lp=760","rokwzgl=4 i lp=760","rokwzgl=5 i lp=760","rokwzgl=6 i lp=760","rokwzgl=7 i lp=760","rokwzgl=8 i lp=760","rokwzgl=9 i lp=760","rokwzgl=10 i lp=760","rokwzgl=11 i lp=760","rokwzgl=12 i lp=760","rokwzgl=13 i lp=760","rokwzgl=14 i lp=760","rokwzgl=15 i lp=760","rokwzgl=16 i lp=760","rokwzgl=17 i lp=760","rokwzgl=18 i lp=760","rokwzgl=19 i lp=760","rokwzgl=20 i lp=760","rokwzgl=21 i lp=760","rokwzgl=22 i lp=760","rokwzgl=23 i lp=760","rokwzgl=24 i lp=760","rokwzgl=25 i lp=760","rokwzgl=26 i lp=760","rokwzgl=27 i lp=760","rokwzgl=28 i lp=760","rokwzgl=29 i lp=760"]
[761,"12.4.1","  -  w tym finansowane środkami określonymi w art. 5 ust. 1 pkt 2 ustawy","rokwzgl=0 i lp=761","rokwzgl=0 i lp=761","rokwzgl=1 i lp=761","rokwzgl=2 i lp=761","rokwzgl=3 i lp=761","rokwzgl=4 i lp=761","rokwzgl=5 i lp=761","rokwzgl=6 i lp=761","rokwzgl=7 i lp=761","rokwzgl=8 i lp=761","rokwzgl=9 i lp=761","rokwzgl=10 i lp=761","rokwzgl=11 i lp=761","rokwzgl=12 i lp=761","rokwzgl=13 i lp=761","rokwzgl=14 i lp=761","rokwzgl=15 i lp=761","rokwzgl=16 i lp=761","rokwzgl=17 i lp=761","rokwzgl=18 i lp=761","rokwzgl=19 i lp=761","rokwzgl=20 i lp=761","rokwzgl=21 i lp=761","rokwzgl=22 i lp=761","rokwzgl=23 i lp=761","rokwzgl=24 i lp=761","rokwzgl=25 i lp=761","rokwzgl=26 i lp=761","rokwzgl=27 i lp=761","rokwzgl=28 i lp=761","rokwzgl=29 i lp=761"]
[762,"12.4.2","  Wydatki majątkowe na realizację programu, projektu lub zadania wynikające wyłącznie z zawartych umów z podmiotem dysponującym środkami, o których mowa w art. 5 ust. 1 pkt 2 ustawy ","rokwzgl=0 i lp=762","rokwzgl=0 i lp=762","rokwzgl=1 i lp=762","rokwzgl=2 i lp=762","rokwzgl=3 i lp=762","rokwzgl=4 i lp=762","rokwzgl=5 i lp=762","rokwzgl=6 i lp=762","rokwzgl=7 i lp=762","rokwzgl=8 i lp=762","rokwzgl=9 i lp=762","rokwzgl=10 i lp=762","rokwzgl=11 i lp=762","rokwzgl=12 i lp=762","rokwzgl=13 i lp=762","rokwzgl=14 i lp=762","rokwzgl=15 i lp=762","rokwzgl=16 i lp=762","rokwzgl=17 i lp=762","rokwzgl=18 i lp=762","rokwzgl=19 i lp=762","rokwzgl=20 i lp=762","rokwzgl=21 i lp=762","rokwzgl=22 i lp=762","rokwzgl=23 i lp=762","rokwzgl=24 i lp=762","rokwzgl=25 i lp=762","rokwzgl=26 i lp=762","rokwzgl=27 i lp=762","rokwzgl=28 i lp=762","rokwzgl=29 i lp=762"]
[763,"12.5"," Wydatki na wkład krajowy w związku z umową na realizację programu, projektu lub zadania finansowanego z udziałem środków, o których mowa w art. 5 ust. 1 pkt 2 ustawy bez względu na stopień finansowania tymi środkami ","rokwzgl=0 i lp=763","rokwzgl=0 i lp=763","rokwzgl=1 i lp=763","rokwzgl=2 i lp=763","rokwzgl=3 i lp=763","rokwzgl=4 i lp=763","rokwzgl=5 i lp=763","rokwzgl=6 i lp=763","rokwzgl=7 i lp=763","rokwzgl=8 i lp=763","rokwzgl=9 i lp=763","rokwzgl=10 i lp=763","rokwzgl=11 i lp=763","rokwzgl=12 i lp=763","rokwzgl=13 i lp=763","rokwzgl=14 i lp=763","rokwzgl=15 i lp=763","rokwzgl=16 i lp=763","rokwzgl=17 i lp=763","rokwzgl=18 i lp=763","rokwzgl=19 i lp=763","rokwzgl=20 i lp=763","rokwzgl=21 i lp=763","rokwzgl=22 i lp=763","rokwzgl=23 i lp=763","rokwzgl=24 i lp=763","rokwzgl=25 i lp=763","rokwzgl=26 i lp=763","rokwzgl=27 i lp=763","rokwzgl=28 i lp=763","rokwzgl=29 i lp=763"]
[764,"12.5.1","  w tym w związku z już zawartą umową na realizację programu, projektu lub zadania","rokwzgl=0 i lp=764","rokwzgl=0 i lp=764","rokwzgl=1 i lp=764","rokwzgl=2 i lp=764","rokwzgl=3 i lp=764","rokwzgl=4 i lp=764","rokwzgl=5 i lp=764","rokwzgl=6 i lp=764","rokwzgl=7 i lp=764","rokwzgl=8 i lp=764","rokwzgl=9 i lp=764","rokwzgl=10 i lp=764","rokwzgl=11 i lp=764","rokwzgl=12 i lp=764","rokwzgl=13 i lp=764","rokwzgl=14 i lp=764","rokwzgl=15 i lp=764","rokwzgl=16 i lp=764","rokwzgl=17 i lp=764","rokwzgl=18 i lp=764","rokwzgl=19 i lp=764","rokwzgl=20 i lp=764","rokwzgl=21 i lp=764","rokwzgl=22 i lp=764","rokwzgl=23 i lp=764","rokwzgl=24 i lp=764","rokwzgl=25 i lp=764","rokwzgl=26 i lp=764","rokwzgl=27 i lp=764","rokwzgl=28 i lp=764","rokwzgl=29 i lp=764"]
[765,"12.6"," Wydatki na wkład krajowy w związku z zawartą po dniu 1 stycznia 2013 r. umową na realizację programu, projektu lub zadania finansowanego w co najmniej 60% środkami, o których mowa w art. 5 ust. 1 pkt 2 ustawy","rokwzgl=0 i lp=765","rokwzgl=0 i lp=765","rokwzgl=1 i lp=765","rokwzgl=2 i lp=765","rokwzgl=3 i lp=765","rokwzgl=4 i lp=765","rokwzgl=5 i lp=765","rokwzgl=6 i lp=765","rokwzgl=7 i lp=765","rokwzgl=8 i lp=765","rokwzgl=9 i lp=765","rokwzgl=10 i lp=765","rokwzgl=11 i lp=765","rokwzgl=12 i lp=765","rokwzgl=13 i lp=765","rokwzgl=14 i lp=765","rokwzgl=15 i lp=765","rokwzgl=16 i lp=765","rokwzgl=17 i lp=765","rokwzgl=18 i lp=765","rokwzgl=19 i lp=765","rokwzgl=20 i lp=765","rokwzgl=21 i lp=765","rokwzgl=22 i lp=765","rokwzgl=23 i lp=765","rokwzgl=24 i lp=765","rokwzgl=25 i lp=765","rokwzgl=26 i lp=765","rokwzgl=27 i lp=765","rokwzgl=28 i lp=765","rokwzgl=29 i lp=765"]
[766,"12.6.1","  w tym w związku z już zawartą umową na realizację programu, projektu lub zadania","rokwzgl=0 i lp=766","rokwzgl=0 i lp=766","rokwzgl=1 i lp=766","rokwzgl=2 i lp=766","rokwzgl=3 i lp=766","rokwzgl=4 i lp=766","rokwzgl=5 i lp=766","rokwzgl=6 i lp=766","rokwzgl=7 i lp=766","rokwzgl=8 i lp=766","rokwzgl=9 i lp=766","rokwzgl=10 i lp=766","rokwzgl=11 i lp=766","rokwzgl=12 i lp=766","rokwzgl=13 i lp=766","rokwzgl=14 i lp=766","rokwzgl=15 i lp=766","rokwzgl=16 i lp=766","rokwzgl=17 i lp=766","rokwzgl=18 i lp=766","rokwzgl=19 i lp=766","rokwzgl=20 i lp=766","rokwzgl=21 i lp=766","rokwzgl=22 i lp=766","rokwzgl=23 i lp=766","rokwzgl=24 i lp=766","rokwzgl=25 i lp=766","rokwzgl=26 i lp=766","rokwzgl=27 i lp=766","rokwzgl=28 i lp=766","rokwzgl=29 i lp=766"]
[767,"12.7"," Przychody z tytułu kredytów, pożyczek, emisji papierów wartościowych powstające w związku z umową na realizację programu, projektu lub zadania finansowanego z udziałem środków, o których mowa w art. 5 ust. 1 pkt 2 ustawy bez względu na stopień finansowania tymi środkami ","rokwzgl=0 i lp=767","rokwzgl=0 i lp=767","rokwzgl=1 i lp=767","rokwzgl=2 i lp=767","rokwzgl=3 i lp=767","rokwzgl=4 i lp=767","rokwzgl=5 i lp=767","rokwzgl=6 i lp=767","rokwzgl=7 i lp=767","rokwzgl=8 i lp=767","rokwzgl=9 i lp=767","rokwzgl=10 i lp=767","rokwzgl=11 i lp=767","rokwzgl=12 i lp=767","rokwzgl=13 i lp=767","rokwzgl=14 i lp=767","rokwzgl=15 i lp=767","rokwzgl=16 i lp=767","rokwzgl=17 i lp=767","rokwzgl=18 i lp=767","rokwzgl=19 i lp=767","rokwzgl=20 i lp=767","rokwzgl=21 i lp=767","rokwzgl=22 i lp=767","rokwzgl=23 i lp=767","rokwzgl=24 i lp=767","rokwzgl=25 i lp=767","rokwzgl=26 i lp=767","rokwzgl=27 i lp=767","rokwzgl=28 i lp=767","rokwzgl=29 i lp=767"]
[768,"12.7.1","  w tym w związku z już zawartą umową na realizację programu, projektu lub zadania","rokwzgl=0 i lp=768","rokwzgl=0 i lp=768","rokwzgl=1 i lp=768","rokwzgl=2 i lp=768","rokwzgl=3 i lp=768","rokwzgl=4 i lp=768","rokwzgl=5 i lp=768","rokwzgl=6 i lp=768","rokwzgl=7 i lp=768","rokwzgl=8 i lp=768","rokwzgl=9 i lp=768","rokwzgl=10 i lp=768","rokwzgl=11 i lp=768","rokwzgl=12 i lp=768","rokwzgl=13 i lp=768","rokwzgl=14 i lp=768","rokwzgl=15 i lp=768","rokwzgl=16 i lp=768","rokwzgl=17 i lp=768","rokwzgl=18 i lp=768","rokwzgl=19 i lp=768","rokwzgl=20 i lp=768","rokwzgl=21 i lp=768","rokwzgl=22 i lp=768","rokwzgl=23 i lp=768","rokwzgl=24 i lp=768","rokwzgl=25 i lp=768","rokwzgl=26 i lp=768","rokwzgl=27 i lp=768","rokwzgl=28 i lp=768","rokwzgl=29 i lp=768"]
[769,"12.8"," Przychody z tytułu kredytów, pożyczek, emisji papierów wartościowych powstające w związku z zawartą po dniu 1 stycznia 2013 r. umową na realizację programu, projektu lub zadania finansowanego w co najmniej 60% środkami, o których mowa w art. 5 ust. 1 pkt 2 ustawy","rokwzgl=0 i lp=769","rokwzgl=0 i lp=769","rokwzgl=1 i lp=769","rokwzgl=2 i lp=769","rokwzgl=3 i lp=769","rokwzgl=4 i lp=769","rokwzgl=5 i lp=769","rokwzgl=6 i lp=769","rokwzgl=7 i lp=769","rokwzgl=8 i lp=769","rokwzgl=9 i lp=769","rokwzgl=10 i lp=769","rokwzgl=11 i lp=769","rokwzgl=12 i lp=769","rokwzgl=13 i lp=769","rokwzgl=14 i lp=769","rokwzgl=15 i lp=769","rokwzgl=16 i lp=769","rokwzgl=17 i lp=769","rokwzgl=18 i lp=769","rokwzgl=19 i lp=769","rokwzgl=20 i lp=769","rokwzgl=21 i lp=769","rokwzgl=22 i lp=769","rokwzgl=23 i lp=769","rokwzgl=24 i lp=769","rokwzgl=25 i lp=769","rokwzgl=26 i lp=769","rokwzgl=27 i lp=769","rokwzgl=28 i lp=769","rokwzgl=29 i lp=769"]
[770,"12.8.1","  w tym w związku z już zawartą umową na realizację programu, projektu lub zadania","rokwzgl=0 i lp=770","rokwzgl=0 i lp=770","rokwzgl=1 i lp=770","rokwzgl=2 i lp=770","rokwzgl=3 i lp=770","rokwzgl=4 i lp=770","rokwzgl=5 i lp=770","rokwzgl=6 i lp=770","rokwzgl=7 i lp=770","rokwzgl=8 i lp=770","rokwzgl=9 i lp=770","rokwzgl=10 i lp=770","rokwzgl=11 i lp=770","rokwzgl=12 i lp=770","rokwzgl=13 i lp=770","rokwzgl=14 i lp=770","rokwzgl=15 i lp=770","rokwzgl=16 i lp=770","rokwzgl=17 i lp=770","rokwzgl=18 i lp=770","rokwzgl=19 i lp=770","rokwzgl=20 i lp=770","rokwzgl=21 i lp=770","rokwzgl=22 i lp=770","rokwzgl=23 i lp=770","rokwzgl=24 i lp=770","rokwzgl=25 i lp=770","rokwzgl=26 i lp=770","rokwzgl=27 i lp=770","rokwzgl=28 i lp=770","rokwzgl=29 i lp=770"]
[790,13,"Kwoty dotyczące przejęcia i spłaty zobowiązań po samodzielnych publicznych zakładach opieki zdrowotnej oraz pokrycia ujemnego wyniku ","rokwzgl=0 i lp=790","rokwzgl=0 i lp=790","rokwzgl=1 i lp=790","rokwzgl=2 i lp=790","rokwzgl=3 i lp=790","rokwzgl=4 i lp=790","rokwzgl=5 i lp=790","rokwzgl=6 i lp=790","rokwzgl=7 i lp=790","rokwzgl=8 i lp=790","rokwzgl=9 i lp=790","rokwzgl=10 i lp=790","rokwzgl=11 i lp=790","rokwzgl=12 i lp=790","rokwzgl=13 i lp=790","rokwzgl=14 i lp=790","rokwzgl=15 i lp=790","rokwzgl=16 i lp=790","rokwzgl=17 i lp=790","rokwzgl=18 i lp=790","rokwzgl=19 i lp=790","rokwzgl=20 i lp=790","rokwzgl=21 i lp=790","rokwzgl=22 i lp=790","rokwzgl=23 i lp=790","rokwzgl=24 i lp=790","rokwzgl=25 i lp=790","rokwzgl=26 i lp=790","rokwzgl=27 i lp=790","rokwzgl=28 i lp=790","rokwzgl=29 i lp=790"]
[800,"13.1"," Kwota zobowiązań wynikających z przejęcia przez jednostkę samorządu terytorialnego zobowiązań po likwidowanych i przekształcanych samodzielnych zakładach opieki zdrowotnej","rokwzgl=0 i lp=800","rokwzgl=0 i lp=800","rokwzgl=1 i lp=800","rokwzgl=2 i lp=800","rokwzgl=3 i lp=800","rokwzgl=4 i lp=800","rokwzgl=5 i lp=800","rokwzgl=6 i lp=800","rokwzgl=7 i lp=800","rokwzgl=8 i lp=800","rokwzgl=9 i lp=800","rokwzgl=10 i lp=800","rokwzgl=11 i lp=800","rokwzgl=12 i lp=800","rokwzgl=13 i lp=800","rokwzgl=14 i lp=800","rokwzgl=15 i lp=800","rokwzgl=16 i lp=800","rokwzgl=17 i lp=800","rokwzgl=18 i lp=800","rokwzgl=19 i lp=800","rokwzgl=20 i lp=800","rokwzgl=21 i lp=800","rokwzgl=22 i lp=800","rokwzgl=23 i lp=800","rokwzgl=24 i lp=800","rokwzgl=25 i lp=800","rokwzgl=26 i lp=800","rokwzgl=27 i lp=800","rokwzgl=28 i lp=800","rokwzgl=29 i lp=800"]
[810,"13.2"," Dochody budżetowe z tytułu dotacji celowej z budżetu państwa, o której mowa w art. 196 ustawy z  dnia 15 kwietnia 2011 r.  o działalności leczniczej (Dz.U. Nr 112, poz. 654, z późn. zm.)","rokwzgl=0 i lp=810","rokwzgl=0 i lp=810","rokwzgl=1 i lp=810","rokwzgl=2 i lp=810","rokwzgl=3 i lp=810","rokwzgl=4 i lp=810","rokwzgl=5 i lp=810","rokwzgl=6 i lp=810","rokwzgl=7 i lp=810","rokwzgl=8 i lp=810","rokwzgl=9 i lp=810","rokwzgl=10 i lp=810","rokwzgl=11 i lp=810","rokwzgl=12 i lp=810","rokwzgl=13 i lp=810","rokwzgl=14 i lp=810","rokwzgl=15 i lp=810","rokwzgl=16 i lp=810","rokwzgl=17 i lp=810","rokwzgl=18 i lp=810","rokwzgl=19 i lp=810","rokwzgl=20 i lp=810","rokwzgl=21 i lp=810","rokwzgl=22 i lp=810","rokwzgl=23 i lp=810","rokwzgl=24 i lp=810","rokwzgl=25 i lp=810","rokwzgl=26 i lp=810","rokwzgl=27 i lp=810","rokwzgl=28 i lp=810","rokwzgl=29 i lp=810"]
[820,"13.3"," Wysokość zobowiązań podlegających umorzeniu, o którym mowa w art. 190 ustawy o działalności leczniczej","rokwzgl=0 i lp=820","rokwzgl=0 i lp=820","rokwzgl=1 i lp=820","rokwzgl=2 i lp=820","rokwzgl=3 i lp=820","rokwzgl=4 i lp=820","rokwzgl=5 i lp=820","rokwzgl=6 i lp=820","rokwzgl=7 i lp=820","rokwzgl=8 i lp=820","rokwzgl=9 i lp=820","rokwzgl=10 i lp=820","rokwzgl=11 i lp=820","rokwzgl=12 i lp=820","rokwzgl=13 i lp=820","rokwzgl=14 i lp=820","rokwzgl=15 i lp=820","rokwzgl=16 i lp=820","rokwzgl=17 i lp=820","rokwzgl=18 i lp=820","rokwzgl=19 i lp=820","rokwzgl=20 i lp=820","rokwzgl=21 i lp=820","rokwzgl=22 i lp=820","rokwzgl=23 i lp=820","rokwzgl=24 i lp=820","rokwzgl=25 i lp=820","rokwzgl=26 i lp=820","rokwzgl=27 i lp=820","rokwzgl=28 i lp=820","rokwzgl=29 i lp=820"]
[830,"13.4"," Wydatki na spłatę przejętych zobowiązań samodzielnego publicznego zakładu opieki zdrowotnej przekształconego na zasadach określonych w przepisach  o działalności leczniczej","rokwzgl=0 i lp=830","rokwzgl=0 i lp=830","rokwzgl=1 i lp=830","rokwzgl=2 i lp=830","rokwzgl=3 i lp=830","rokwzgl=4 i lp=830","rokwzgl=5 i lp=830","rokwzgl=6 i lp=830","rokwzgl=7 i lp=830","rokwzgl=8 i lp=830","rokwzgl=9 i lp=830","rokwzgl=10 i lp=830","rokwzgl=11 i lp=830","rokwzgl=12 i lp=830","rokwzgl=13 i lp=830","rokwzgl=14 i lp=830","rokwzgl=15 i lp=830","rokwzgl=16 i lp=830","rokwzgl=17 i lp=830","rokwzgl=18 i lp=830","rokwzgl=19 i lp=830","rokwzgl=20 i lp=830","rokwzgl=21 i lp=830","rokwzgl=22 i lp=830","rokwzgl=23 i lp=830","rokwzgl=24 i lp=830","rokwzgl=25 i lp=830","rokwzgl=26 i lp=830","rokwzgl=27 i lp=830","rokwzgl=28 i lp=830","rokwzgl=29 i lp=830"]
[840,"13.5"," Wydatki na spłatę przejętych zobowiązań samodzielnego publicznego zakładu opieki zdrowotnej likwidowanego na zasadach określonych w przepisach  o działalności leczniczej","rokwzgl=0 i lp=840","rokwzgl=0 i lp=840","rokwzgl=1 i lp=840","rokwzgl=2 i lp=840","rokwzgl=3 i lp=840","rokwzgl=4 i lp=840","rokwzgl=5 i lp=840","rokwzgl=6 i lp=840","rokwzgl=7 i lp=840","rokwzgl=8 i lp=840","rokwzgl=9 i lp=840","rokwzgl=10 i lp=840","rokwzgl=11 i lp=840","rokwzgl=12 i lp=840","rokwzgl=13 i lp=840","rokwzgl=14 i lp=840","rokwzgl=15 i lp=840","rokwzgl=16 i lp=840","rokwzgl=17 i lp=840","rokwzgl=18 i lp=840","rokwzgl=19 i lp=840",{"$f":"+\"rokwzgl=\"&Y$9&\" i lp=\"&$A100","v":"rokwzgl=20 i lp=840"},"rokwzgl=21 i lp=840","rokwzgl=22 i lp=840","rokwzgl=23 i lp=840","rokwzgl=24 i lp=840","rokwzgl=25 i lp=840","rokwzgl=26 i lp=840","rokwzgl=27 i lp=840","rokwzgl=28 i lp=840","rokwzgl=29 i lp=840"]
[850,"13.6"," Wydatki na spłatę zobowiązań samodzielnego publicznego zakładu opieki zdrowotnej przejętych do końca 2011 r. na podstawie przepisów o zakładach opieki zdrowotnej","rokwzgl=0 i lp=850","rokwzgl=0 i lp=850","rokwzgl=1 i lp=850","rokwzgl=2 i lp=850","rokwzgl=3 i lp=850","rokwzgl=4 i lp=850","rokwzgl=5 i lp=850","rokwzgl=6 i lp=850","rokwzgl=7 i lp=850","rokwzgl=8 i lp=850","rokwzgl=9 i lp=850","rokwzgl=10 i lp=850","rokwzgl=11 i lp=850","rokwzgl=12 i lp=850","rokwzgl=13 i lp=850","rokwzgl=14 i lp=850","rokwzgl=15 i lp=850","rokwzgl=16 i lp=850","rokwzgl=17 i lp=850","rokwzgl=18 i lp=850","rokwzgl=19 i lp=850","rokwzgl=20 i lp=850","rokwzgl=21 i lp=850","rokwzgl=22 i lp=850","rokwzgl=23 i lp=850","rokwzgl=24 i lp=850","rokwzgl=25 i lp=850","rokwzgl=26 i lp=850","rokwzgl=27 i lp=850","rokwzgl=28 i lp=850","rokwzgl=29 i lp=850"]
[860,"13.7"," Wydatki bieżące na pokrycie ujemnego wyniku finansowego samodzielnego publicznego zakładu opieki zdrowotnej","rokwzgl=0 i lp=860","rokwzgl=0 i lp=860","rokwzgl=1 i lp=860","rokwzgl=2 i lp=860","rokwzgl=3 i lp=860","rokwzgl=4 i lp=860","rokwzgl=5 i lp=860","rokwzgl=6 i lp=860","rokwzgl=7 i lp=860","rokwzgl=8 i lp=860","rokwzgl=9 i lp=860","rokwzgl=10 i lp=860","rokwzgl=11 i lp=860","rokwzgl=12 i lp=860","rokwzgl=13 i lp=860",{"$f":"+\"rokwzgl=\"&S$9&\" i lp=\"&$A102","v":"rokwzgl=14 i lp=860"},"rokwzgl=15 i lp=860","rokwzgl=16 i lp=860","rokwzgl=17 i lp=860","rokwzgl=18 i lp=860","rokwzgl=19 i lp=860","rokwzgl=20 i lp=860","rokwzgl=21 i lp=860","rokwzgl=22 i lp=860","rokwzgl=23 i lp=860","rokwzgl=24 i lp=860","rokwzgl=25 i lp=860","rokwzgl=26 i lp=860","rokwzgl=27 i lp=860","rokwzgl=28 i lp=860","rokwzgl=29 i lp=860"]
[870,14,"Dane uzupełniające o długu i jego spłacie",{"$f":"+\"rokwzgl=\"&D$9&\" i lp=\"&$A103","v":"rokwzgl=0 i lp=870"},"rokwzgl=0 i lp=870","rokwzgl=1 i lp=870","rokwzgl=2 i lp=870","rokwzgl=3 i lp=870","rokwzgl=4 i lp=870","rokwzgl=5 i lp=870","rokwzgl=6 i lp=870","rokwzgl=7 i lp=870","rokwzgl=8 i lp=870","rokwzgl=9 i lp=870","rokwzgl=10 i lp=870","rokwzgl=11 i lp=870","rokwzgl=12 i lp=870","rokwzgl=13 i lp=870","rokwzgl=14 i lp=870","rokwzgl=15 i lp=870","rokwzgl=16 i lp=870","rokwzgl=17 i lp=870","rokwzgl=18 i lp=870","rokwzgl=19 i lp=870","rokwzgl=20 i lp=870","rokwzgl=21 i lp=870","rokwzgl=22 i lp=870","rokwzgl=23 i lp=870","rokwzgl=24 i lp=870","rokwzgl=25 i lp=870","rokwzgl=26 i lp=870","rokwzgl=27 i lp=870","rokwzgl=28 i lp=870","rokwzgl=29 i lp=870"]
[880,"14.1"," Spłaty rat kapitałowych oraz wykup papierów wartościowych, o których mowa w pkt. 5.1., wynikające wyłącznie z tytułu zobowiązań już zaciągniętych","rokwzgl=0 i lp=880","rokwzgl=0 i lp=880","rokwzgl=1 i lp=880","rokwzgl=2 i lp=880","rokwzgl=3 i lp=880","rokwzgl=4 i lp=880","rokwzgl=5 i lp=880","rokwzgl=6 i lp=880","rokwzgl=7 i lp=880","rokwzgl=8 i lp=880","rokwzgl=9 i lp=880","rokwzgl=10 i lp=880","rokwzgl=11 i lp=880","rokwzgl=12 i lp=880","rokwzgl=13 i lp=880","rokwzgl=14 i lp=880","rokwzgl=15 i lp=880","rokwzgl=16 i lp=880","rokwzgl=17 i lp=880","rokwzgl=18 i lp=880","rokwzgl=19 i lp=880","rokwzgl=20 i lp=880","rokwzgl=21 i lp=880","rokwzgl=22 i lp=880","rokwzgl=23 i lp=880","rokwzgl=24 i lp=880","rokwzgl=25 i lp=880","rokwzgl=26 i lp=880","rokwzgl=27 i lp=880","rokwzgl=28 i lp=880","rokwzgl=29 i lp=880"]
[890,"14.2"," Kwota długu, którego planowana spłata dokona się z wydatków budżetu","rokwzgl=0 i lp=890","rokwzgl=0 i lp=890","rokwzgl=1 i lp=890","rokwzgl=2 i lp=890","rokwzgl=3 i lp=890","rokwzgl=4 i lp=890","rokwzgl=5 i lp=890","rokwzgl=6 i lp=890","rokwzgl=7 i lp=890","rokwzgl=8 i lp=890","rokwzgl=9 i lp=890","rokwzgl=10 i lp=890","rokwzgl=11 i lp=890","rokwzgl=12 i lp=890","rokwzgl=13 i lp=890","rokwzgl=14 i lp=890","rokwzgl=15 i lp=890","rokwzgl=16 i lp=890","rokwzgl=17 i lp=890","rokwzgl=18 i lp=890","rokwzgl=19 i lp=890","rokwzgl=20 i lp=890","rokwzgl=21 i lp=890","rokwzgl=22 i lp=890","rokwzgl=23 i lp=890","rokwzgl=24 i lp=890","rokwzgl=25 i lp=890","rokwzgl=26 i lp=890","rokwzgl=27 i lp=890","rokwzgl=28 i lp=890","rokwzgl=29 i lp=890"]
[900,"14.3"," Wydatki zmniejszające dług, w tym","rokwzgl=0 i lp=900","rokwzgl=0 i lp=900","rokwzgl=1 i lp=900","rokwzgl=2 i lp=900","rokwzgl=3 i lp=900","rokwzgl=4 i lp=900","rokwzgl=5 i lp=900","rokwzgl=6 i lp=900","rokwzgl=7 i lp=900","rokwzgl=8 i lp=900","rokwzgl=9 i lp=900","rokwzgl=10 i lp=900","rokwzgl=11 i lp=900","rokwzgl=12 i lp=900","rokwzgl=13 i lp=900","rokwzgl=14 i lp=900","rokwzgl=15 i lp=900","rokwzgl=16 i lp=900","rokwzgl=17 i lp=900","rokwzgl=18 i lp=900","rokwzgl=19 i lp=900","rokwzgl=20 i lp=900","rokwzgl=21 i lp=900","rokwzgl=22 i lp=900","rokwzgl=23 i lp=900","rokwzgl=24 i lp=900","rokwzgl=25 i lp=900","rokwzgl=26 i lp=900","rokwzgl=27 i lp=900","rokwzgl=28 i lp=900","rokwzgl=29 i lp=900"]
[910,"14.3.1","  spłata zobowiązań wymagalnych z lat poprzednich, innych niż w pkt 14.3.3","rokwzgl=0 i lp=910","rokwzgl=0 i lp=910","rokwzgl=1 i lp=910","rokwzgl=2 i lp=910","rokwzgl=3 i lp=910","rokwzgl=4 i lp=910","rokwzgl=5 i lp=910","rokwzgl=6 i lp=910","rokwzgl=7 i lp=910","rokwzgl=8 i lp=910","rokwzgl=9 i lp=910","rokwzgl=10 i lp=910","rokwzgl=11 i lp=910","rokwzgl=12 i lp=910","rokwzgl=13 i lp=910","rokwzgl=14 i lp=910","rokwzgl=15 i lp=910","rokwzgl=16 i lp=910","rokwzgl=17 i lp=910","rokwzgl=18 i lp=910","rokwzgl=19 i lp=910","rokwzgl=20 i lp=910","rokwzgl=21 i lp=910","rokwzgl=22 i lp=910","rokwzgl=23 i lp=910","rokwzgl=24 i lp=910","rokwzgl=25 i lp=910","rokwzgl=26 i lp=910","rokwzgl=27 i lp=910","rokwzgl=28 i lp=910","rokwzgl=29 i lp=910"]
[920,"14.3.2","  związane z umowami zaliczanymi do tytułów dłużnych wliczanych do państwowego długu publicznego","rokwzgl=0 i lp=920","rokwzgl=0 i lp=920","rokwzgl=1 i lp=920","rokwzgl=2 i lp=920","rokwzgl=3 i lp=920","rokwzgl=4 i lp=920","rokwzgl=5 i lp=920","rokwzgl=6 i lp=920","rokwzgl=7 i lp=920","rokwzgl=8 i lp=920","rokwzgl=9 i lp=920","rokwzgl=10 i lp=920","rokwzgl=11 i lp=920","rokwzgl=12 i lp=920","rokwzgl=13 i lp=920","rokwzgl=14 i lp=920","rokwzgl=15 i lp=920","rokwzgl=16 i lp=920","rokwzgl=17 i lp=920","rokwzgl=18 i lp=920","rokwzgl=19 i lp=920","rokwzgl=20 i lp=920","rokwzgl=21 i lp=920","rokwzgl=22 i lp=920","rokwzgl=23 i lp=920","rokwzgl=24 i lp=920","rokwzgl=25 i lp=920","rokwzgl=26 i lp=920","rokwzgl=27 i lp=920","rokwzgl=28 i lp=920","rokwzgl=29 i lp=920"]
[930,"14.3.3","  wypłaty z tytułu wymagalnych poręczeń i gwarancji","rokwzgl=0 i lp=930","rokwzgl=0 i lp=930","rokwzgl=1 i lp=930","rokwzgl=2 i lp=930","rokwzgl=3 i lp=930","rokwzgl=4 i lp=930","rokwzgl=5 i lp=930","rokwzgl=6 i lp=930","rokwzgl=7 i lp=930","rokwzgl=8 i lp=930","rokwzgl=9 i lp=930","rokwzgl=10 i lp=930","rokwzgl=11 i lp=930","rokwzgl=12 i lp=930","rokwzgl=13 i lp=930","rokwzgl=14 i lp=930","rokwzgl=15 i lp=930","rokwzgl=16 i lp=930","rokwzgl=17 i lp=930","rokwzgl=18 i lp=930","rokwzgl=19 i lp=930","rokwzgl=20 i lp=930","rokwzgl=21 i lp=930","rokwzgl=22 i lp=930","rokwzgl=23 i lp=930","rokwzgl=24 i lp=930","rokwzgl=25 i lp=930","rokwzgl=26 i lp=930","rokwzgl=27 i lp=930","rokwzgl=28 i lp=930","rokwzgl=29 i lp=930"]
[940,"14.4"," Wynik operacji niekasowych wpływających na kwotę długu ( m.in. umorzenia, różnice kursowe)","rokwzgl=0 i lp=940","rokwzgl=0 i lp=940","rokwzgl=1 i lp=940","rokwzgl=2 i lp=940","rokwzgl=3 i lp=940","rokwzgl=4 i lp=940","rokwzgl=5 i lp=940","rokwzgl=6 i lp=940","rokwzgl=7 i lp=940","rokwzgl=8 i lp=940","rokwzgl=9 i lp=940","rokwzgl=10 i lp=940","rokwzgl=11 i lp=940","rokwzgl=12 i lp=940","rokwzgl=13 i lp=940","rokwzgl=14 i lp=940","rokwzgl=15 i lp=940","rokwzgl=16 i lp=940","rokwzgl=17 i lp=940","rokwzgl=18 i lp=940","rokwzgl=19 i lp=940","rokwzgl=20 i lp=940","rokwzgl=21 i lp=940","rokwzgl=22 i lp=940","rokwzgl=23 i lp=940","rokwzgl=24 i lp=940","rokwzgl=25 i lp=940","rokwzgl=26 i lp=940","rokwzgl=27 i lp=940","rokwzgl=28 i lp=940","rokwzgl=29 i lp=940"]
[950,15,"Dane dotyczące emitowanych obligacji przychodowych","rokwzgl=0 i lp=950","rokwzgl=0 i lp=950","rokwzgl=1 i lp=950","rokwzgl=2 i lp=950","rokwzgl=3 i lp=950","rokwzgl=4 i lp=950","rokwzgl=5 i lp=950","rokwzgl=6 i lp=950","rokwzgl=7 i lp=950","rokwzgl=8 i lp=950","rokwzgl=9 i lp=950","rokwzgl=10 i lp=950","rokwzgl=11 i lp=950","rokwzgl=12 i lp=950","rokwzgl=13 i lp=950","rokwzgl=14 i lp=950","rokwzgl=15 i lp=950","rokwzgl=16 i lp=950","rokwzgl=17 i lp=950","rokwzgl=18 i lp=950","rokwzgl=19 i lp=950","rokwzgl=20 i lp=950","rokwzgl=21 i lp=950","rokwzgl=22 i lp=950","rokwzgl=23 i lp=950","rokwzgl=24 i lp=950","rokwzgl=25 i lp=950","rokwzgl=26 i lp=950","rokwzgl=27 i lp=950","rokwzgl=28 i lp=950","rokwzgl=29 i lp=950"]
[960,"15.1"," Środki z przedsięwzięcia gromadzone na rachunku bankowym,  w tym:","rokwzgl=0 i lp=960","rokwzgl=0 i lp=960","rokwzgl=1 i lp=960","rokwzgl=2 i lp=960","rokwzgl=3 i lp=960","rokwzgl=4 i lp=960","rokwzgl=5 i lp=960","rokwzgl=6 i lp=960","rokwzgl=7 i lp=960","rokwzgl=8 i lp=960","rokwzgl=9 i lp=960","rokwzgl=10 i lp=960","rokwzgl=11 i lp=960","rokwzgl=12 i lp=960","rokwzgl=13 i lp=960","rokwzgl=14 i lp=960","rokwzgl=15 i lp=960","rokwzgl=16 i lp=960","rokwzgl=17 i lp=960","rokwzgl=18 i lp=960","rokwzgl=19 i lp=960","rokwzgl=20 i lp=960","rokwzgl=21 i lp=960","rokwzgl=22 i lp=960","rokwzgl=23 i lp=960","rokwzgl=24 i lp=960","rokwzgl=25 i lp=960","rokwzgl=26 i lp=960","rokwzgl=27 i lp=960","rokwzgl=28 i lp=960","rokwzgl=29 i lp=960"]
[970,"15.1.1","  środki na zaspokojenie roszczeń obligatariuszy","rokwzgl=0 i lp=970","rokwzgl=0 i lp=970","rokwzgl=1 i lp=970","rokwzgl=2 i lp=970","rokwzgl=3 i lp=970","rokwzgl=4 i lp=970","rokwzgl=5 i lp=970","rokwzgl=6 i lp=970","rokwzgl=7 i lp=970","rokwzgl=8 i lp=970","rokwzgl=9 i lp=970","rokwzgl=10 i lp=970","rokwzgl=11 i lp=970","rokwzgl=12 i lp=970","rokwzgl=13 i lp=970","rokwzgl=14 i lp=970","rokwzgl=15 i lp=970","rokwzgl=16 i lp=970","rokwzgl=17 i lp=970","rokwzgl=18 i lp=970","rokwzgl=19 i lp=970","rokwzgl=20 i lp=970","rokwzgl=21 i lp=970","rokwzgl=22 i lp=970","rokwzgl=23 i lp=970","rokwzgl=24 i lp=970","rokwzgl=25 i lp=970","rokwzgl=26 i lp=970","rokwzgl=27 i lp=970","rokwzgl=28 i lp=970","rokwzgl=29 i lp=970"]
[980,"15.2"," Wydatki bieżące z tytułu świadczenia emitenta należnego obligatariuszom,  nieuwzględniane  w limicie spłaty zobowiązań, o którym mowa w art. 243 ustawy","rokwzgl=0 i lp=980","rokwzgl=0 i lp=980","rokwzgl=1 i lp=980","rokwzgl=2 i lp=980","rokwzgl=3 i lp=980","rokwzgl=4 i lp=980","rokwzgl=5 i lp=980","rokwzgl=6 i lp=980","rokwzgl=7 i lp=980","rokwzgl=8 i lp=980","rokwzgl=9 i lp=980","rokwzgl=10 i lp=980","rokwzgl=11 i lp=980","rokwzgl=12 i lp=980","rokwzgl=13 i lp=980","rokwzgl=14 i lp=980","rokwzgl=15 i lp=980","rokwzgl=16 i lp=980","rokwzgl=17 i lp=980","rokwzgl=18 i lp=980","rokwzgl=19 i lp=980","rokwzgl=20 i lp=980","rokwzgl=21 i lp=980","rokwzgl=22 i lp=980","rokwzgl=23 i lp=980","rokwzgl=24 i lp=980","rokwzgl=25 i lp=980","rokwzgl=26 i lp=980","rokwzgl=27 i lp=980","rokwzgl=28 i lp=980","rokwzgl=29 i lp=980"]

{"sheet":"rysunki","index":3,"n_rows":84,"n_cols":9,"rows_kept":84,"cut":false,"hidden":false,"merged":[]}
["Analiza graficzna danych z WPF",null,null,null,null,null,null,null,{"$f":"Zał.1_WPF_bazowy!D5&\" - \"&\"WPF za lata \"&Zał.1_WPF_bazowy!D6&\" - Nr Uchwały JST: \"&Zał.1_WPF_bazowy!D4","v":"KRZYŻANÓW - WPF za lata 2015 - 2018 - Nr Uchwały JST: 1"}]
[]
[]
[]
[]
[]
[]
[]
[]
[]
[]
[]
[]
[]
[]
[]
[]
[]
[]
[]
[]
[]
[]
[]
[]
[]
[]
[]
[]
[]
[]
[]
[]
[]
[]
[]
[]
[]
[]
[]
[]
[]
[]
[]
[]
[]
[]
[]
[]
[]
[]
[]
[]
[]
[]
[]
[]
[]
[]
[]
[]
[]
[]
[]
[]
[]
[null,"Rysunek z wskaźnikiem planistycznym",null,null,null,null,null,null,"Rysunek z wskaźnikiem planistycznym"]
[]
[]
[]
[]
[]
[]
[]
[]
[]
[]
[]
[]
[]
[]
[]
[]
[null,"Rysunek z wskaźnikiem wg wykonania",null,null,null,null,null,null,"Rysunek z wskaźnikiem wg wykonania"]

{"sheet":"DaneZrodlowe","index":4,"n_rows":439,"n_cols":17,"rows_kept":439,"cut":false,"hidden":true,"merged":[]}
["Wyciąg danych z tabeli \"Wieloletnia prognoza finansowa\" wprowadzonych do systemu BESTI@ z wybranej uchwały ",null,null,null,null,null,null,null,null,null,null,null,"Rok bazowy:",{"$f":"MIN(M:M)","v":2015},null,"Rok max",{"$f":"MAX(M:M)","v":2018}]
[]
["budzet","numer","nazwajst","kodgus","gt","mswia","lp","symbol","formula","wyszczegolnienie","wsk243","rokwzgl","rokprognozy","prognoza","DataPodjecia","DataWejscia"]
[2015,"1","KRZYŻANÓW",1002052,2,null,30,"1.1.1",null,"  dochody z tytułu udziału we wpływach z podatku dochodowego od osób fizycznych",true,1,2016,1433008,"2014-12-19","2015-01-01"]
[2015,1,"KRZYŻANÓW",1002052,2,null,500,9.4,"(([2.1.1]-[2.1.1.1]) + ([2.1.3.1]-[2.1.3.1.1]-[2.1.3.1.2])+([5.1]-[5.1.1])+[9.3]) /([1]-[15.1.1])"," Wskaźnik planowanej łącznej kwoty spłaty zobowiązań, o której mowa w art. 243 ust. 1 ustawy do dochodów, po uwzględnieniu zobowiązań związku współtworzonego przez jednostkę samorządu terytorialnego oraz po uwzględnieniu ustawowych wyłączeń przypadających na dany rok",false,3,2018,0,"2014-12-19","2015-01-01"]
[2015,1,"KRZYŻANÓW",1002052,2,null,650,11.6,null," Wydatki majątkowe w formie dotacji ",true,1,2016,0,"2014-12-19","2015-01-01"]
[2015,1,"KRZYŻANÓW",1002052,2,null,767,12.7,null," Przychody z tytułu kredytów, pożyczek, emisji papierów wartościowych powstające w związku z umową na realizację programu, projektu lub zadania finansowanego z udziałem środków, o których mowa w art. 5 ust. 1 pkt 2 ustawy bez względu na stopień finansowania tymi środkami ",true,3,2018,0,"2014-12-19","2015-01-01"]
[2015,1,"KRZYŻANÓW",1002052,2,null,762,"12.4.2",null,"  Wydatki majątkowe na realizację programu, projektu lub zadania wynikające wyłącznie z zawartych umów z podmiotem dysponującym środkami, o których mowa w art. 5 ust. 1 pkt 2 ustawy ",true,1,2016,0,"2014-12-19","2015-01-01"]
[2015,1,"KRZYŻANÓW",1002052,2,null,400,7,null,"Kwota zobowiązań wynikających z przejęcia przez jednostkę samorządu terytorialnego zobowiązań po likwidowanych i przekształcanych jednostkach zaliczanych do sektora  finansów publicznych",true,3,2018,0,"2014-12-19","2015-01-01"]
[2015,1,"KRZYŻANÓW",1002052,2,null,950,15,null,"Dane dotyczące emitowanych obligacji przychodowych",true,2,2017,0,"2014-12-19","2015-01-01"]
[2015,1,"KRZYŻANÓW",1002052,2,null,100,"1.2.1",null,"  ze sprzedaży majątku",true,3,2018,0,"2014-12-19","2015-01-01"]
[2015,1,"KRZYŻANÓW",1002052,2,null,350,6,null,"Kwota długu",true,2,2017,0,"2014-12-19","2015-01-01"]
[2015,1,"KRZYŻANÓW",1002052,2,null,500,9.4,"(([2.1.1]-[2.1.1.1]) + ([2.1.3.1]-[2.1.3.1.1]-[2.1.3.1.2])+([5.1]-[5.1.1])+[9.3]) /([1]-[15.1.1])"," Wskaźnik planowanej łącznej kwoty spłaty zobowiązań, o której mowa w art. 243 ust. 1 ustawy do dochodów, po uwzględnieniu zobowiązań związku współtworzonego przez jednostkę samorządu terytorialnego oraz po uwzględnieniu ustawowych wyłączeń przypadających na dany rok",false,0,2015,2.2599999999999999E-2,"2014-12-19","2015-01-01"]
[2015,1,"KRZYŻANÓW",1002052,2,null,880,14.1,null," Spłaty rat kapitałowych oraz wykup papierów wartościowych, o których mowa w pkt. 5.1., wynikające wyłącznie z tytułu zobowiązań już zaciągniętych",true,0,2015,169179.6,"2014-12-19","2015-01-01"]
[2015,1,"KRZYŻANÓW",1002052,2,null,540,"9.7.1","[9.6.1]-[9.4]","  Informacja o spełnieniu wskaźnika spłaty zobowiązań określonego w art. 243 ustawy, po uwzględnieniu zobowiązań związku współtworzonego przez jednostkę samorządu terytorialnego oraz po uwzględnieniu ustawowych wyłączeń, obliczonego w oparciu o wykonanie roku poprzedzającego rok budżetowy",false,1,2016,1317,"2014-12-19","2015-01-01"]
[2015,1,"KRZYŻANÓW",1002052,2,null,230,"4.1.1",null,"  w tym na pokrycie deficytu budżetu",false,2,2017,0,"2014-12-19","2015-01-01"]
[2015,1,"KRZYŻANÓW",1002052,2,null,700,12.2,null," Dochody majątkowe  na programy, projekty lub zadania finansowane z udziałem środków, o których mowa w art. 5 ust. 1 pkt 2 i 3 ustawy",false,0,2015,7900,"2014-12-19","2015-01-01"]
[2015,1,"KRZYŻANÓW",1002052,2,null,350,6,null,"Kwota długu",true,1,2016,701387.6,"2014-12-19","2015-01-01"]
[2015,1,"KRZYŻANÓW",1002052,2,null,430,8.1999999999999993,"[1.1] + [4.1] + [4.2] - (  [2.1] - [2.1.2]  )"," Różnica między dochodami bieżącymi, skorygowanymi o środki a wydatkami bieżącymi, pomniejszonymi  o wydatki",false,2,2017,3427269.6,"2014-12-19","2015-01-01"]
[2015,1,"KRZYŻANÓW",1002052,2,null,440,9,null,"Wskaźnik spłaty zobowiązań",false,3,2018,0,"2014-12-19","2015-01-01"]
[2015,1,"KRZYŻANÓW",1002052,2,null,600,11.3,"[11.3.1] + [11.3.2]"," Wydatki objęte limitem, o którym mowa w art. 226 ust. 3 pkt 4 ustawy",true,2,2017,0,"2014-12-19","2015-01-01"]
[2015,1,"KRZYŻANÓW",1002052,2,null,740,"12.3.1",null,"  -  w tym finansowane środkami określonymi w art. 5 ust. 1 pkt 2 ustawy ",false,2,2017,0,"2014-12-19","2015-01-01"]
[2015,1,"KRZYŻANÓW",1002052,2,null,190,2.2000000000000002,null," Wydatki majątkowe",false,0,2015,3749615,"2014-12-19","2015-01-01"]
[2015,1,"KRZYŻANÓW",1002052,2,null,420,8.1,"[1.1] - [2.1]"," Różnica między dochodami bieżącymi a  wydatkami bieżącymi",false,1,2016,3461390,"2014-12-19","2015-01-01"]
[2015,1,"KRZYŻANÓW",1002052,2,null,850,13.6,null," Wydatki na spłatę zobowiązań samodzielnego publicznego zakładu opieki zdrowotnej przejętych do końca 2011 r. na podstawie przepisów o zakładach opieki zdrowotnej",true,1,2016,0,"2014-12-19","2015-01-01"]
[2015,1,"KRZYŻANÓW",1002052,2,null,300,5,"[5.1] + [5.2]","Rozchody budżetu",false,3,2018,0,"2014-12-19","2015-01-01"]
[2015,1,"KRZYŻANÓW",1002052,2,null,600,11.3,"[11.3.1] + [11.3.2]"," Wydatki objęte limitem, o którym mowa w art. 226 ust. 3 pkt 4 ustawy",true,3,2018,0,"2014-12-19","2015-01-01"]
[2015,1,"KRZYŻANÓW",1002052,2,null,120,2,"[2.1] + [2.2]","Wydatki ogółem",false,0,2015,13118844,"2014-12-19","2015-01-01"]
[2015,1,"KRZYŻANÓW",1002052,2,null,800,13.1,null," Kwota zobowiązań wynikających z przejęcia przez jednostkę samorządu terytorialnego zobowiązań po likwidowanych i przekształcanych samodzielnych zakładach opieki zdrowotnej",true,2,2017,0,"2014-12-19","2015-01-01"]
[2015,1,"KRZYŻANÓW",1002052,2,null,400,7,null,"Kwota zobowiązań wynikających z przejęcia przez jednostkę samorządu terytorialnego zobowiązań po likwidowanych i przekształcanych jednostkach zaliczanych do sektora  finansów publicznych",true,1,2016,0,"2014-12-19","2015-01-01"]
[2015,1,"KRZYŻANÓW",1002052,2,null,420,8.1,"[1.1] - [2.1]"," Różnica między dochodami bieżącymi a  wydatkami bieżącymi",false,3,2018,3349090,"2014-12-19","2015-01-01"]
[2015,1,"KRZYŻANÓW",1002052,2,null,1000,16.100000000000001,null," Stopień niezachowania relacji zrównoważenia wydatków bieżących, o której mowa w poz. 8.2.",true,1,2016,0,"2014-12-19","2015-01-01"]
[2015,1,"KRZYŻANÓW",1002052,2,null,790,13,null,"Kwoty dotyczące przejęcia i spłaty zobowiązań po samodzielnych publicznych zakładach opieki zdrowotnej oraz pokrycia ujemnego wyniku ",true,1,2016,0,"2014-12-19","2015-01-01"]
[2015,1,"KRZYŻANÓW",1002052,2,null,210,4,"[4.1] + [4.2] + [4.3] + [4.4]","Przychody budżetu",false,1,2016,0,"2014-12-19","2015-01-01"]
[2015,1,"KRZYŻANÓW",1002052,2,null,890,14.2,null," Kwota długu, którego planowana spłata dokona się z wydatków budżetu",true,0,2015,0,"2014-12-19","2015-01-01"]
[2015,1,"KRZYŻANÓW",1002052,2,null,768,"12.7.1",null,"  w tym w związku z już zawartą umową na realizację programu, projektu lub zadania",true,0,2015,0,"2014-12-19","2015-01-01"]
[2015,1,"KRZYŻANÓW",1002052,2,null,440,9,null,"Wskaźnik spłaty zobowiązań",false,0,2015,0,"2014-12-19","2015-01-01"]
[2015,1,"KRZYŻANÓW",1002052,2,null,20,1.1000000000000001,null," Dochody bieżące",true,3,2018,13379740,"2014-12-19","2015-01-01"]
[2015,1,"KRZYŻANÓW",1002052,2,null,840,13.5,null," Wydatki na spłatę przejętych zobowiązań samodzielnego publicznego zakładu opieki zdrowotnej likwidowanego na zasadach określonych w przepisach  o działalności leczniczej",true,1,2016,0,"2014-12-19","2015-01-01"]
[2015,1,"KRZYŻANÓW",1002052,2,null,650,11.6,null," Wydatki majątkowe w formie dotacji ",true,3,2018,0,"2014-12-19","2015-01-01"]
[2015,1,"KRZYŻANÓW",1002052,2,null,750,"12.3.2",null,"  Wydatki bieżące na realizację programu, projektu lub zadania wynikające wyłącznie z zawartych umów z podmiotem dysponującym środkami, o których mowa w art. 5 ust. 1 pkt 2 ustawy ",false,1,2016,0,"2014-12-19","2015-01-01"]
[2015,1,"KRZYŻANÓW",1002052,2,null,768,"12.7.1",null,"  w tym w związku z już zawartą umową na realizację programu, projektu lub zadania",true,1,2016,0,"2014-12-19","2015-01-01"]
[2015,1,"KRZYŻANÓW",1002052,2,null,290,"4.4.1",null,"   w tym na pokrycie deficytu budżetu",false,3,2018,0,"2014-12-19","2015-01-01"]
[2015,1,"KRZYŻANÓW",1002052,2,null,300,5,"[5.1] + [5.2]","Rozchody budżetu",false,2,2017,701387.6,"2014-12-19","2015-01-01"]
[2015,1,"KRZYŻANÓW",1002052,2,null,940,14.4,null," Wynik operacji niekasowych wpływających na kwotę długu ( m.in. umorzenia, różnice kursowe)",true,3,2018,0,"2014-12-19","2015-01-01"]
[2015,1,"KRZYŻANÓW",1002052,2,null,250,"4.2.1",null,"   w tym na pokrycie deficytu budżetu",false,2,2017,0,"2014-12-19","2015-01-01"]
[2015,1,"KRZYŻANÓW",1002052,2,null,910,"14.3.1",null,"  spłata zobowiązań wymagalnych z lat poprzednich, innych niż w pkt 14.3.3",true,3,2018,0,"2014-12-19","2015-01-01"]
[2015,1,"KRZYŻANÓW",1002052,2,null,910,"14.3.1",null,"  spłata zobowiązań wymagalnych z lat poprzednich, innych niż w pkt 14.3.3",true,1,2016,0,"2014-12-19","2015-01-01"]
[2015,1,"KRZYŻANÓW",1002052,2,null,890,14.2,null," Kwota długu, którego planowana spłata dokona się z wydatków budżetu",true,2,2017,0,"2014-12-19","2015-01-01"]
[2015,1,"KRZYŻANÓW",1002052,2,null,560,10.1,null," Spłaty kredytów, pożyczek i wykup papierów wartościowych",false,1,2016,701400,"2014-12-19","2015-01-01"]
[2015,1,"KRZYŻANÓW",1002052,2,null,900,14.3,null," Wydatki zmniejszające dług, w tym",true,0,2015,0,"2014-12-19","2015-01-01"]
[2015,1,"KRZYŻANÓW",1002052,2,null,830,13.4,null," Wydatki na spłatę przejętych zobowiązań samodzielnego publicznego zakładu opieki zdrowotnej przekształconego na zasadach określonych w przepisach  o działalności leczniczej",true,1,2016,0,"2014-12-19","2015-01-01"]
[2015,1,"KRZYŻANÓW",1002052,2,null,800,13.1,null," Kwota zobowiązań wynikających z przejęcia przez jednostkę samorządu terytorialnego zobowiązań po likwidowanych i przekształcanych samodzielnych zakładach opieki zdrowotnej",true,1,2016,0,"2014-12-19","2015-01-01"]
[2015,1,"KRZYŻANÓW",1002052,2,null,40,"1.1.2",null,"  dochody z tytułu udziału we wpływach z podatku dochodowego od osób prawnych",true,2,2017,2000,"2014-12-19","2015-01-01"]
[2015,1,"KRZYŻANÓW",1002052,2,null,920,"14.3.2",null,"  związane z umowami zaliczanymi do tytułów dłużnych wliczanych do państwowego długu publicznego",true,2,2017,0,"2014-12-19","2015-01-01"]
[2015,1,"KRZYŻANÓW",1002052,2,null,80,"1.1.5",null,"  z tytułu dotacji i środków przeznaczonych na cele bieżące",true,3,2018,1273753,"2014-12-19","2015-01-01"]
[2015,1,"KRZYŻANÓW",1002052,2,null,270,"4.3.1",null,"   w tym na pokrycie deficytu budżetu",true,2,2017,0,"2014-12-19","2015-01-01"]
[2015,1,"KRZYŻANÓW",1002052,2,null,830,13.4,null," Wydatki na spłatę przejętych zobowiązań samodzielnego publicznego zakładu opieki zdrowotnej przekształconego na zasadach określonych w przepisach  o działalności leczniczej",true,2,2017,0,"2014-12-19","2015-01-01"]
[2015,1,"KRZYŻANÓW",1002052,2,null,440,9,null,"Wskaźnik spłaty zobowiązań",false,2,2017,0,"2014-12-19","2015-01-01"]
[2015,1,"KRZYŻANÓW",1002052,2,null,1000,16.100000000000001,null," Stopień niezachowania relacji zrównoważenia wydatków bieżących, o której mowa w poz. 8.2.",true,2,2017,0,"2014-12-19","2015-01-01"]
[2015,1,"KRZYŻANÓW",1002052,2,null,220,4.0999999999999996,null," Nadwyżka budżetowa z lat ubiegłych",false,3,2018,0,"2014-12-19","2015-01-01"]
[2015,1,"KRZYŻANÓW",1002052,2,null,180,"2.1.3.1",null,"   odsetki i dyskonto określone w art. 243 ust. 1 ustawy, w tym:",false,1,2016,70000,"2014-12-19","2015-01-01"]
[2015,1,"KRZYŻANÓW",1002052,2,null,990,16,null,"Stopnie niezachowania relacji określonych w art. 242-244 ustawy w przypadku określonym w @par16_1 ustawy",true,0,2015,0,"2014-12-19","2015-01-01"]
[2015,1,"KRZYŻANÓW",1002052,2,null,690,"12.1.1.1",null,"   - w tym środki określone w art. 5 ust. 1 pkt 2 ustawy wynikające wyłącznie z  zawartych umów na realizację programu, projektu lub zadania",true,2,2017,0,"2014-12-19","2015-01-01"]
[2015,1,"KRZYŻANÓW",1002052,2,null,860,13.7,null," Wydatki bieżące na pokrycie ujemnego wyniku finansowego samodzielnego publicznego zakładu opieki zdrowotnej",true,1,2016,0,"2014-12-19","2015-01-01"]
[2015,1,"KRZYŻANÓW",1002052,2,null,110,"1.2.2",null,"  z tytułu dotacji oraz środków przeznaczonych na inwestycje",true,2,2017,0,"2014-12-19","2015-01-01"]
[2015,1,"KRZYŻANÓW",1002052,2,null,150,"2.1.1.1",null,"   w tym: gwarancje i poręczenia podlegające wyłączeniu z limitu spłaty zobowiązań, o którym mowa w art. 243 ustawy",true,3,2018,0,"2014-12-19","2015-01-01"]
[2015,1,"KRZYŻANÓW",1002052,2,null,660,12,null,"Finansowanie programów, projektów lub zadań realizowanych z udziałem środków, o których mowa w art. 5 ust. 1 pkt 2 i 3 ustawy",true,1,2016,0,"2014-12-19","2015-01-01"]
[2015,1,"KRZYŻANÓW",1002052,2,null,540,"9.7.1","[9.6.1]-[9.4]","  Informacja o spełnieniu wskaźnika spłaty zobowiązań określonego w art. 243 ustawy, po uwzględnieniu zobowiązań związku współtworzonego przez jednostkę samorządu terytorialnego oraz po uwzględnieniu ustawowych wyłączeń, obliczonego w oparciu o wykonanie roku poprzedzającego rok budżetowy",false,2,2017,1550,"2014-12-19","2015-01-01"]
[2015,1,"KRZYŻANÓW",1002052,2,null,820,13.3,null," Wysokość zobowiązań podlegających umorzeniu, o którym mowa w art. 190 ustawy o działalności leczniczej",true,0,2015,0,"2014-12-19","2015-01-01"]
[2015,1,"KRZYŻANÓW",1002052,2,null,60,"1.1.3.1",null,"   z podatku od nieruchomości",true,1,2016,2669340,"2014-12-19","2015-01-01"]
[2015,1,"KRZYŻANÓW",1002052,2,null,620,"11.3.2",null,"   majątkowe",true,0,2015,945000,"2014-12-19","2015-01-01"]
[2015,1,"KRZYŻANÓW",1002052,2,null,30,"1.1.1",null,"  dochody z tytułu udziału we wpływach z podatku dochodowego od osób fizycznych",true,3,2018,1461811,"2014-12-19","2015-01-01"]
[2015,1,"KRZYŻANÓW",1002052,2,null,332,"5.1.1.1",null,"   kwota przypadających na dany rok kwot ustawowych wyłączeń określonych w art. 243 ust. 3 ustawy",true,1,2016,0,"2014-12-19","2015-01-01"]
[2015,1,"KRZYŻANÓW",1002052,2,null,620,"11.3.2",null,"   majątkowe",true,3,2018,0,"2014-12-19","2015-01-01"]
[2015,1,"KRZYŻANÓW",1002052,2,null,570,11,null,"Informacje uzupełniające o wybranych rodzajach wydatków budżetowych",false,2,2017,0,"2014-12-19","2015-01-01"]
[2015,1,"KRZYŻANÓW",1002052,2,null,690,"12.1.1.1",null,"   - w tym środki określone w art. 5 ust. 1 pkt 2 ustawy wynikające wyłącznie z  zawartych umów na realizację programu, projektu lub zadania",true,0,2015,0,"2014-12-19","2015-01-01"]
[2015,1,"KRZYŻANÓW",1002052,2,null,80,"1.1.5",null,"  z tytułu dotacji i środków przeznaczonych na cele bieżące",true,2,2017,1273753,"2014-12-19","2015-01-01"]
[2015,1,"KRZYŻANÓW",1002052,2,null,140,"2.1.1",null,"  z tytułu poręczeń i gwarancji",true,3,2018,0,"2014-12-19","2015-01-01"]
[2015,1,"KRZYŻANÓW",1002052,2,null,960,15.1,null," Środki z przedsięwzięcia gromadzone na rachunku bankowym,  w tym:",true,1,2016,0,"2014-12-19","2015-01-01"]
[2015,1,"KRZYŻANÓW",1002052,2,null,110,"1.2.2",null,"  z tytułu dotacji oraz środków przeznaczonych na inwestycje",true,1,2016,0,"2014-12-19","2015-01-01"]
[2015,1,"KRZYŻANÓW",1002052,2,null,30,"1.1.1",null,"  dochody z tytułu udziału we wpływach z podatku dochodowego od osób fizycznych",true,2,2017,1447338,"2014-12-19","2015-01-01"]
[2015,1,"KRZYŻANÓW",1002052,2,null,820,13.3,null," Wysokość zobowiązań podlegających umorzeniu, o którym mowa w art. 190 ustawy o działalności leczniczej",true,3,2018,0,"2014-12-19","2015-01-01"]
[2015,1,"KRZYŻANÓW",1002052,2,null,336,"5.1.1.3",null,"   kwota przypadających na dany rok kwot ustawowych wyłączeń innych niż określone w art. 243 ustawy",true,1,2016,0,"2014-12-19","2015-01-01"]
[2015,1,"KRZYŻANÓW",1002052,2,null,20,1.1000000000000001,null," Dochody bieżące",true,2,2017,13247270,"2014-12-19","2015-01-01"]
[2015,1,"KRZYŻANÓW",1002052,2,null,766,"12.6.1",null,"  w tym w związku z już zawartą umową na realizację programu, projektu lub zadania",true,0,2015,0,"2014-12-19","2015-01-01"]
[2015,1,"KRZYŻANÓW",1002052,2,null,334,"5.1.1.2",null,"   kwota przypadających na dany rok kwot ustawowych wyłączeń określonych w art. 243 ust. 3a ustawy",true,0,2015,0,"2014-12-19","2015-01-01"]
[2015,1,"KRZYŻANÓW",1002052,2,null,770,"12.8.1",null,"  w tym w związku z już zawartą umową na realizację programu, projektu lub zadania",true,1,2016,0,"2014-12-19","2015-01-01"]
[2015,1,"KRZYŻANÓW",1002052,2,null,334,"5.1.1.2",null,"   kwota przypadających na dany rok kwot ustawowych wyłączeń określonych w art. 243 ust. 3a ustawy",true,1,2016,0,"2014-12-19","2015-01-01"]
[2015,1,"KRZYŻANÓW",1002052,2,null,790,13,null,"Kwoty dotyczące przejęcia i spłaty zobowiązań po samodzielnych publicznych zakładach opieki zdrowotnej oraz pokrycia ujemnego wyniku ",true,3,2018,0,"2014-12-19","2015-01-01"]
[2015,1,"KRZYŻANÓW",1002052,2,null,970,"15.1.1",null,"  środki na zaspokojenie roszczeń obligatariuszy",true,1,2016,0,"2014-12-19","2015-01-01"]
[2015,1,"KRZYŻANÓW",1002052,2,null,840,13.5,null," Wydatki na spłatę przejętych zobowiązań samodzielnego publicznego zakładu opieki zdrowotnej likwidowanego na zasadach określonych w przepisach  o działalności leczniczej",true,3,2018,0,"2014-12-19","2015-01-01"]
[2015,1,"KRZYŻANÓW",1002052,2,null,520,"9.6.1",null,"   Dopuszczalny wskaźnik spłaty zobowiązań określony w art. 243 ustawy, po uwzględnieniu ustawowych wyłączeń, obliczony w oparciu o wykonanie roku poprzedzającego pierwszy rok prognozy (wskaźnik ustalony w oparciu o średnią arytmetyczną z 3 poprzednich lat) ",true,2,2017,0.21049999999999999,"2014-12-19","2015-01-01"]
[2015,1,"KRZYŻANÓW",1002052,2,null,700,12.2,null," Dochody majątkowe  na programy, projekty lub zadania finansowane z udziałem środków, o których mowa w art. 5 ust. 1 pkt 2 i 3 ustawy",false,3,2018,0,"2014-12-19","2015-01-01"]
[2015,1,"KRZYŻANÓW",1002052,2,null,970,"15.1.1",null,"  środki na zaspokojenie roszczeń obligatariuszy",true,2,2017,0,"2014-12-19","2015-01-01"]
[2015,1,"KRZYŻANÓW",1002052,2,null,290,"4.4.1",null,"   w tym na pokrycie deficytu budżetu",false,2,2017,0,"2014-12-19","2015-01-01"]
[2015,1,"KRZYŻANÓW",1002052,2,null,120,2,"[2.1] + [2.2]","Wydatki ogółem",false,1,2016,12414710,"2014-12-19","2015-01-01"]
[2015,1,"KRZYŻANÓW",1002052,2,null,280,4.4000000000000004,null," Inne przychody niezwiązane z zaciągnięciem długu",false,1,2016,0,"2014-12-19","2015-01-01"]
[2015,1,"KRZYŻANÓW",1002052,2,null,1010,16.2,null," Stopień niezachowania wskaźnika spłaty zobowiązań, o którym mowa w poz. 9.7.",true,0,2015,0,"2014-12-19","2015-01-01"]
[2015,1,"KRZYŻANÓW",1002052,2,null,310,5.0999999999999996,null," Spłaty rat kapitałowych kredytów i pożyczek oraz wykup papierów wartościowych",true,1,2016,701400,"2014-12-19","2015-01-01"]
[2015,1,"KRZYŻANÓW",1002052,2,null,270,"4.3.1",null,"   w tym na pokrycie deficytu budżetu",true,0,2015,1233608,"2014-12-19","2015-01-01"]
[2015,1,"KRZYŻANÓW",1002052,2,null,1020,16.3,null," Stopień niezachowania wskaźnika spłaty zobowiązań, o którym mowa w poz. 9.7.1.",true,1,2016,0,"2014-12-19","2015-01-01"]
[2015,1,"KRZYŻANÓW",1002052,2,null,761,"12.4.1",null,"  -  w tym finansowane środkami określonymi w art. 5 ust. 1 pkt 2 ustawy",true,1,2016,0,"2014-12-19","2015-01-01"]
[2015,1,"KRZYŻANÓW",1002052,2,null,160,"2.1.2",null,"   na spłatę przejętych zobowiązań samodzielnego publicznego zakładu opieki zdrowotnej przekształconego na zasadach określonych w przepisach  o działalności leczniczej, w wysokości w jakiej nie podlegają sfinansowaniu dotacją z budżetu państwa",true,3,2018,0,"2014-12-19","2015-01-01"]
[2015,1,"KRZYŻANÓW",1002052,2,null,760,12.4,null," Wydatki majątkowe na programy, projekty lub zadania finansowane z udziałem środków, o których mowa w art. 5 ust. 1 pkt 2 i 3 ustawy",true,0,2015,0,"2014-12-19","2015-01-01"]
[2015,1,"KRZYŻANÓW",1002052,2,null,660,12,null,"Finansowanie programów, projektów lub zadań realizowanych z udziałem środków, o których mowa w art. 5 ust. 1 pkt 2 i 3 ustawy",true,3,2018,0,"2014-12-19","2015-01-01"]
[2015,1,"KRZYŻANÓW",1002052,2,null,90,1.2,null,"  Dochody majątkowe, w tym",true,0,2015,7900,"2014-12-19","2015-01-01"]
[2015,1,"KRZYŻANÓW",1002052,2,null,580,11.1,null," Wydatki bieżące na wynagrodzenia i składki od nich naliczane",false,0,2015,4417511,"2014-12-19","2015-01-01"]
[2015,1,"KRZYŻANÓW",1002052,2,null,220,4.0999999999999996,null," Nadwyżka budżetowa z lat ubiegłych",false,1,2016,0,"2014-12-19","2015-01-01"]
[2015,1,"KRZYŻANÓW",1002052,2,null,940,14.4,null," Wynik operacji niekasowych wpływających na kwotę długu ( m.in. umorzenia, różnice kursowe)",true,1,2016,0,"2014-12-19","2015-01-01"]
[2015,1,"KRZYŻANÓW",1002052,2,null,700,12.2,null," Dochody majątkowe  na programy, projekty lub zadania finansowane z udziałem środków, o których mowa w art. 5 ust. 1 pkt 2 i 3 ustawy",false,1,2016,0,"2014-12-19","2015-01-01"]
[2015,1,"KRZYŻANÓW",1002052,2,null,750,"12.3.2",null,"  Wydatki bieżące na realizację programu, projektu lub zadania wynikające wyłącznie z zawartych umów z podmiotem dysponującym środkami, o których mowa w art. 5 ust. 1 pkt 2 ustawy ",false,0,2015,0,"2014-12-19","2015-01-01"]
[2015,1,"KRZYŻANÓW",1002052,2,null,20,1.1000000000000001,null," Dochody bieżące",true,0,2015,11877336,"2014-12-19","2015-01-01"]
[2015,1,"KRZYŻANÓW",1002052,2,null,870,14,null,"Dane uzupełniające o długu i jego spłacie",true,3,2018,0,"2014-12-19","2015-01-01"]
[2015,1,"KRZYŻANÓW",1002052,2,null,761,"12.4.1",null,"  -  w tym finansowane środkami określonymi w art. 5 ust. 1 pkt 2 ustawy",true,0,2015,0,"2014-12-19","2015-01-01"]
[2015,1,"KRZYŻANÓW",1002052,2,null,762,"12.4.2",null,"  Wydatki majątkowe na realizację programu, projektu lub zadania wynikające wyłącznie z zawartych umów z podmiotem dysponującym środkami, o których mowa w art. 5 ust. 1 pkt 2 ustawy ",true,0,2015,0,"2014-12-19","2015-01-01"]
[2015,1,"KRZYŻANÓW",1002052,2,null,900,14.3,null," Wydatki zmniejszające dług, w tym",true,3,2018,0,"2014-12-19","2015-01-01"]
[2015,1,"KRZYŻANÓW",1002052,2,null,730,12.3,null," Wydatki bieżące na programy, projekty lub zadania finansowane z udziałem środków, o których mowa w art. 5 ust. 1 pkt 2 i 3 ustawy",false,1,2016,0,"2014-12-19","2015-01-01"]
[2015,1,"KRZYŻANÓW",1002052,2,null,480,9.1999999999999993,"( ([2.1.1]-[2.1.1.1])+([2.1.3.1]-[2.1.3.1.1]-[2.1.3.1.2])+([5.1]-[5.1.1]) )/([1]-[15.1.1])"," Wskaźnik planowanej łącznej kwoty spłaty zobowiązań, o której mowa w art. 243 ust. 1 ustawy do dochodów, bez uwzględnienia zobowiązań związku współtworzonego przez jednostkę samorządu terytorialnego, po uwzględnieniu ustawowych wyłączeń przypadających na dany rok.",false,0,2015,2.2599999999999999E-2,"2014-12-19","2015-01-01"]
[2015,1,"KRZYŻANÓW",1002052,2,null,508,9.5,"(([1.1] - [15.1.1])+[1.2.1] - ([2.1]-[2.1.2]-[15.2]))/ ([1]-[15.1.1])"," Wskaźnik dochodów bieżących powiększonych o dochody ze sprzedaży majątku oraz pomniejszonych o wydatki bieżące, do dochodów budżetu, ustalony dla danego roku (wskaźnik jednoroczny)",false,1,2016,0.26390000000000002,"2014-12-19","2015-01-01"]
[2015,1,"KRZYŻANÓW",1002052,2,null,510,9.6,null," Dopuszczalny wskaźnik spłaty zobowiązań określony w art. 243 ustawy, po uwzględnieniu ustawowych wyłączeń , obliczony w oparciu o plan 3 kwartału roku poprzedzającego pierwszy rok prognozy (wskaźnik ustalony w oparciu o średnią arytmetyczną z 3 poprzednich lat) ",true,1,2016,0.1918,"2014-12-19","2015-01-01"]
[2015,1,"KRZYŻANÓW",1002052,2,null,70,"1.1.4",null,"  z subwencji ogólnej",true,2,2017,3940400,"2014-12-19","2015-01-01"]
[2015,1,"KRZYŻANÓW",1002052,2,null,120,2,"[2.1] + [2.2]","Wydatki ogółem",false,2,2017,12545882.4,"2014-12-19","2015-01-01"]
[2015,1,"KRZYŻANÓW",1002052,2,null,190,2.2000000000000002,null," Wydatki majątkowe",false,3,2018,3349090,"2014-12-19","2015-01-01"]
[2015,1,"KRZYŻANÓW",1002052,2,null,550,10,null,"Przeznaczenie prognozowanej nadwyżki budżetowej,  w tym na:",false,0,2015,0,"2014-12-19","2015-01-01"]
[2015,1,"KRZYŻANÓW",1002052,2,null,480,9.1999999999999993,"( ([2.1.1]-[2.1.1.1])+([2.1.3.1]-[2.1.3.1.1]-[2.1.3.1.2])+([5.1]-[5.1.1]) )/([1]-[15.1.1])"," Wskaźnik planowanej łącznej kwoty spłaty zobowiązań, o której mowa w art. 243 ust. 1 ustawy do dochodów, bez uwzględnienia zobowiązań związku współtworzonego przez jednostkę samorządu terytorialnego, po uwzględnieniu ustawowych wyłączeń przypadających na dany rok.",false,1,2016,5.8799999999999998E-2,"2014-12-19","2015-01-01"]
[2015,1,"KRZYŻANÓW",1002052,2,null,400,7,null,"Kwota zobowiązań wynikających z przejęcia przez jednostkę samorządu terytorialnego zobowiązań po likwidowanych i przekształcanych jednostkach zaliczanych do sektora  finansów publicznych",true,0,2015,0,"2014-12-19","2015-01-01"]
[2015,1,"KRZYŻANÓW",1002052,2,null,763,12.5,null," Wydatki na wkład krajowy w związku z umową na realizację programu, projektu lub zadania finansowanego z udziałem środków, o których mowa w art. 5 ust. 1 pkt 2 ustawy bez względu na stopień finansowania tymi środkami ",true,1,2016,0,"2014-12-19","2015-01-01"]
[2015,1,"KRZYŻANÓW",1002052,2,null,270,"4.3.1",null,"   w tym na pokrycie deficytu budżetu",true,3,2018,0,"2014-12-19","2015-01-01"]
[2015,1,"KRZYŻANÓW",1002052,2,null,160,"2.1.2",null,"   na spłatę przejętych zobowiązań samodzielnego publicznego zakładu opieki zdrowotnej przekształconego na zasadach określonych w przepisach  o działalności leczniczej, w wysokości w jakiej nie podlegają sfinansowaniu dotacją z budżetu państwa",true,2,2017,0,"2014-12-19","2015-01-01"]
[2015,1,"KRZYŻANÓW",1002052,2,null,530,9.6999999999999993,"[9.6]-[9.4]"," Informacja o spełnieniu wskaźnika spłaty zobowiązań określonego w art. 243 ustawy, po uwzględnieniu zobowiązań związku współtworzonego przez jednostkę samorządu terytorialnego oraz po uwzględnieniu ustawowych wyłączeń, obliczonego w oparciu o plan 3 kwartałów roku poprzedzającego rok budżetowy",false,2,2017,1564,"2014-12-19","2015-01-01"]
[2015,1,"KRZYŻANÓW",1002052,2,null,768,"12.7.1",null,"  w tym w związku z już zawartą umową na realizację programu, projektu lub zadania",true,3,2018,0,"2014-12-19","2015-01-01"]
[2015,1,"KRZYŻANÓW",1002052,2,null,980,15.2,null," Wydatki bieżące z tytułu świadczenia emitenta należnego obligatariuszom,  nieuwzględniane  w limicie spłaty zobowiązań, o którym mowa w art. 243 ustawy",true,3,2018,0,"2014-12-19","2015-01-01"]
[2015,1,"KRZYŻANÓW",1002052,2,null,950,15,null,"Dane dotyczące emitowanych obligacji przychodowych",true,0,2015,0,"2014-12-19","2015-01-01"]
[2015,1,"KRZYŻANÓW",1002052,2,null,220,4.0999999999999996,null," Nadwyżka budżetowa z lat ubiegłych",false,2,2017,0,"2014-12-19","2015-01-01"]
[2015,1,"KRZYŻANÓW",1002052,2,null,610,"11.3.1",null,"   bieżące",true,1,2016,0,"2014-12-19","2015-01-01"]
[2015,1,"KRZYŻANÓW",1002052,2,null,640,11.5,null," Nowe wydatki inwestycyjne",true,2,2017,2725882,"2014-12-19","2015-01-01"]
[2015,1,"KRZYŻANÓW",1002052,2,null,240,4.2,null," Wolne środki, o których mowa w art. 217 ust.2 pkt 6 ustawy",false,2,2017,0,"2014-12-19","2015-01-01"]
[2015,1,"KRZYŻANÓW",1002052,2,null,790,13,null,"Kwoty dotyczące przejęcia i spłaty zobowiązań po samodzielnych publicznych zakładach opieki zdrowotnej oraz pokrycia ujemnego wyniku ",true,0,2015,0,"2014-12-19","2015-01-01"]
[2015,1,"KRZYŻANÓW",1002052,2,null,170,"2.1.3",null,"  wydatki na obsługę długu, w tym:",true,3,2018,0,"2014-12-19","2015-01-01"]
[2015,1,"KRZYŻANÓW",1002052,2,null,769,12.8,null," Przychody z tytułu kredytów, pożyczek, emisji papierów wartościowych powstające w związku z zawartą po dniu 1 stycznia 2013 r. umową na realizację programu, projektu lub zadania finansowanego w co najmniej 60% środkami, o których mowa w art. 5 ust. 1 pkt 2 ustawy",true,2,2017,0,"2014-12-19","2015-01-01"]
[2015,1,"KRZYŻANÓW",1002052,2,null,760,12.4,null," Wydatki majątkowe na programy, projekty lub zadania finansowane z udziałem środków, o których mowa w art. 5 ust. 1 pkt 2 i 3 ustawy",true,3,2018,0,"2014-12-19","2015-01-01"]
[2015,1,"KRZYŻANÓW",1002052,2,null,550,10,null,"Przeznaczenie prognozowanej nadwyżki budżetowej,  w tym na:",false,1,2016,701400,"2014-12-19","2015-01-01"]
[2015,1,"KRZYŻANÓW",1002052,2,null,40,"1.1.2",null,"  dochody z tytułu udziału we wpływach z podatku dochodowego od osób prawnych",true,1,2016,2000,"2014-12-19","2015-01-01"]
[2015,1,"KRZYŻANÓW",1002052,2,null,100,"1.2.1",null,"  ze sprzedaży majątku",true,0,2015,0,"2014-12-19","2015-01-01"]
[2015,1,"KRZYŻANÓW",1002052,2,null,960,15.1,null," Środki z przedsięwzięcia gromadzone na rachunku bankowym,  w tym:",true,0,2015,0,"2014-12-19","2015-01-01"]
[2015,1,"KRZYŻANÓW",1002052,2,null,765,12.6,null," Wydatki na wkład krajowy w związku z zawartą po dniu 1 stycznia 2013 r. umową na realizację programu, projektu lub zadania finansowanego w co najmniej 60% środkami, o których mowa w art. 5 ust. 1 pkt 2 ustawy",true,1,2016,0,"2014-12-19","2015-01-01"]
[2015,1,"KRZYŻANÓW",1002052,2,null,182,"2.1.3.1.1",null,"    odsetki i dyskonto podlegające wyłączeniu z limitu spłaty zobowiązań, o którym mowa w art. 243 ustawy, w terminie nie dłuższym niż 90 dni po zakończeniu programu, projektu lub zadania i otrzymaniu refundacji z tych środków (bez odsetek i dyskonta od zobowiązań na wkład krajowy)",false,3,2018,0,"2014-12-19","2015-01-01"]
[2015,1,"KRZYŻANÓW",1002052,2,null,810,13.2,null," Dochody budżetowe z tytułu dotacji celowej z budżetu państwa, o której mowa w art. 196 ustawy z  dnia 15 kwietnia 2011 r.  o działalności leczniczej (Dz.U. Nr 112, poz. 654, z późn. zm.)",true,3,2018,0,"2014-12-19","2015-01-01"]
[2015,1,"KRZYŻANÓW",1002052,2,null,182,"2.1.3.1.1",null,"    odsetki i dyskonto podlegające wyłączeniu z limitu spłaty zobowiązań, o którym mowa w art. 243 ustawy, w terminie nie dłuższym niż 90 dni po zakończeniu programu, projektu lub zadania i otrzymaniu refundacji z tych środków (bez odsetek i dyskonta od zobowiązań na wkład krajowy)",false,2,2017,0,"2014-12-19","2015-01-01"]
[2015,1,"KRZYŻANÓW",1002052,2,null,880,14.1,null," Spłaty rat kapitałowych oraz wykup papierów wartościowych, o których mowa w pkt. 5.1., wynikające wyłącznie z tytułu zobowiązań już zaciągniętych",true,2,2017,701387.6,"2014-12-19","2015-01-01"]
[2015,1,"KRZYŻANÓW",1002052,2,null,880,14.1,null," Spłaty rat kapitałowych oraz wykup papierów wartościowych, o których mowa w pkt. 5.1., wynikające wyłącznie z tytułu zobowiązań już zaciągniętych",true,3,2018,0,"2014-12-19","2015-01-01"]
[2015,1,"KRZYŻANÓW",1002052,2,null,765,12.6,null," Wydatki na wkład krajowy w związku z zawartą po dniu 1 stycznia 2013 r. umową na realizację programu, projektu lub zadania finansowanego w co najmniej 60% środkami, o których mowa w art. 5 ust. 1 pkt 2 ustawy",true,3,2018,0,"2014-12-19","2015-01-01"]
[2015,1,"KRZYŻANÓW",1002052,2,null,769,12.8,null," Przychody z tytułu kredytów, pożyczek, emisji papierów wartościowych powstające w związku z zawartą po dniu 1 stycznia 2013 r. umową na realizację programu, projektu lub zadania finansowanego w co najmniej 60% środkami, o których mowa w art. 5 ust. 1 pkt 2 ustawy",true,1,2016,0,"2014-12-19","2015-01-01"]
[2015,1,"KRZYŻANÓW",1002052,2,null,761,"12.4.1",null,"  -  w tym finansowane środkami określonymi w art. 5 ust. 1 pkt 2 ustawy",true,2,2017,0,"2014-12-19","2015-01-01"]
[2015,1,"KRZYŻANÓW",1002052,2,null,140,"2.1.1",null,"  z tytułu poręczeń i gwarancji",true,2,2017,0,"2014-12-19","2015-01-01"]
[2015,1,"KRZYŻANÓW",1002052,2,null,950,15,null,"Dane dotyczące emitowanych obligacji przychodowych",true,3,2018,0,"2014-12-19","2015-01-01"]
[2015,1,"KRZYŻANÓW",1002052,2,null,550,10,null,"Przeznaczenie prognozowanej nadwyżki budżetowej,  w tym na:",false,3,2018,0,"2014-12-19","2015-01-01"]
[2015,1,"KRZYŻANÓW",1002052,2,null,920,"14.3.2",null,"  związane z umowami zaliczanymi do tytułów dłużnych wliczanych do państwowego długu publicznego",true,0,2015,0,"2014-12-19","2015-01-01"]
[2015,1,"KRZYŻANÓW",1002052,2,null,332,"5.1.1.1",null,"   kwota przypadających na dany rok kwot ustawowych wyłączeń określonych w art. 243 ust. 3 ustawy",true,3,2018,0,"2014-12-19","2015-01-01"]
[2015,1,"KRZYŻANÓW",1002052,2,null,900,14.3,null," Wydatki zmniejszające dług, w tym",true,1,2016,0,"2014-12-19","2015-01-01"]
[2015,1,"KRZYŻANÓW",1002052,2,null,190,2.2000000000000002,null," Wydatki majątkowe",false,2,2017,2725882,"2014-12-19","2015-01-01"]
[2015,1,"KRZYŻANÓW",1002052,2,null,310,5.0999999999999996,null," Spłaty rat kapitałowych kredytów i pożyczek oraz wykup papierów wartościowych",true,3,2018,0,"2014-12-19","2015-01-01"]
[2015,1,"KRZYŻANÓW",1002052,2,null,334,"5.1.1.2",null,"   kwota przypadających na dany rok kwot ustawowych wyłączeń określonych w art. 243 ust. 3a ustawy",true,2,2017,0,"2014-12-19","2015-01-01"]
[2015,1,"KRZYŻANÓW",1002052,2,null,110,"1.2.2",null,"  z tytułu dotacji oraz środków przeznaczonych na inwestycje",true,0,2015,7900,"2014-12-19","2015-01-01"]
[2015,1,"KRZYŻANÓW",1002052,2,null,120,2,"[2.1] + [2.2]","Wydatki ogółem",false,3,2018,13379740,"2014-12-19","2015-01-01"]
[2015,1,"KRZYŻANÓW",1002052,2,null,100,"1.2.1",null,"  ze sprzedaży majątku",true,1,2016,0,"2014-12-19","2015-01-01"]
[2015,1,"KRZYŻANÓW",1002052,2,null,590,11.2,null," Wydatki związane z funkcjonowaniem organów jednostki samorządu terytorialnego",true,2,2017,1608127,"2014-12-19","2015-01-01"]
[2015,1,"KRZYŻANÓW",1002052,2,null,160,"2.1.2",null,"   na spłatę przejętych zobowiązań samodzielnego publicznego zakładu opieki zdrowotnej przekształconego na zasadach określonych w przepisach  o działalności leczniczej, w wysokości w jakiej nie podlegają sfinansowaniu dotacją z budżetu państwa",true,0,2015,0,"2014-12-19","2015-01-01"]
[2015,1,"KRZYŻANÓW",1002052,2,null,764,"12.5.1",null,"  w tym w związku z już zawartą umową na realizację programu, projektu lub zadania",true,2,2017,0,"2014-12-19","2015-01-01"]
[2015,1,"KRZYŻANÓW",1002052,2,null,670,12.1,null," Dochody bieżące  na programy, projekty lub zadania finansowane z udziałem środków, o których mowa w art. 5 ust. 1 pkt 2 i 3 ustawy",true,1,2016,0,"2014-12-19","2015-01-01"]
[2015,1,"KRZYŻANÓW",1002052,2,null,250,"4.2.1",null,"   w tym na pokrycie deficytu budżetu",false,1,2016,0,"2014-12-19","2015-01-01"]
[2015,1,"KRZYŻANÓW",1002052,2,null,860,13.7,null," Wydatki bieżące na pokrycie ujemnego wyniku finansowego samodzielnego publicznego zakładu opieki zdrowotnej",true,3,2018,0,"2014-12-19","2015-01-01"]
[2015,1,"KRZYŻANÓW",1002052,2,null,730,12.3,null," Wydatki bieżące na programy, projekty lub zadania finansowane z udziałem środków, o których mowa w art. 5 ust. 1 pkt 2 i 3 ustawy",false,3,2018,0,"2014-12-19","2015-01-01"]
[2015,1,"KRZYŻANÓW",1002052,2,null,720,"12.2.1.1",null,"    - w tym środki określone w art. 5 ust. 1 pkt 2 ustawy wynikające wyłącznie z zawartych umów na realizację programu, projektu lub zadania",false,1,2016,0,"2014-12-19","2015-01-01"]
[2015,1,"KRZYŻANÓW",1002052,2,null,500,9.4,"(([2.1.1]-[2.1.1.1]) + ([2.1.3.1]-[2.1.3.1.1]-[2.1.3.1.2])+([5.1]-[5.1.1])+[9.3]) /([1]-[15.1.1])"," Wskaźnik planowanej łącznej kwoty spłaty zobowiązań, o której mowa w art. 243 ust. 1 ustawy do dochodów, po uwzględnieniu zobowiązań związku współtworzonego przez jednostkę samorządu terytorialnego oraz po uwzględnieniu ustawowych wyłączeń przypadających na dany rok",false,1,2016,5.8799999999999998E-2,"2014-12-19","2015-01-01"]
[2015,1,"KRZYŻANÓW",1002052,2,null,230,"4.1.1",null,"  w tym na pokrycie deficytu budżetu",false,1,2016,0,"2014-12-19","2015-01-01"]
[2015,1,"KRZYŻANÓW",1002052,2,null,880,14.1,null," Spłaty rat kapitałowych oraz wykup papierów wartościowych, o których mowa w pkt. 5.1., wynikające wyłącznie z tytułu zobowiązań już zaciągniętych",true,1,2016,701400,"2014-12-19","2015-01-01"]
[2015,1,"KRZYŻANÓW",1002052,2,null,410,8,null,"Relacja zrównoważenia wydatków bieżących, o której mowa w art. 242 ustawy",true,0,2015,0,"2014-12-19","2015-01-01"]
[2015,1,"KRZYŻANÓW",1002052,2,null,740,"12.3.1",null,"  -  w tym finansowane środkami określonymi w art. 5 ust. 1 pkt 2 ustawy ",false,3,2018,0,"2014-12-19","2015-01-01"]
[2015,1,"KRZYŻANÓW",1002052,2,null,770,"12.8.1",null,"  w tym w związku z już zawartą umową na realizację programu, projektu lub zadania",true,2,2017,0,"2014-12-19","2015-01-01"]
[2015,1,"KRZYŻANÓW",1002052,2,null,820,13.3,null," Wysokość zobowiązań podlegających umorzeniu, o którym mowa w art. 190 ustawy o działalności leczniczej",true,2,2017,0,"2014-12-19","2015-01-01"]
[2015,1,"KRZYŻANÓW",1002052,2,null,550,10,null,"Przeznaczenie prognozowanej nadwyżki budżetowej,  w tym na:",false,2,2017,701387.6,"2014-12-19","2015-01-01"]
[2015,1,"KRZYŻANÓW",1002052,2,null,670,12.1,null," Dochody bieżące  na programy, projekty lub zadania finansowane z udziałem środków, o których mowa w art. 5 ust. 1 pkt 2 i 3 ustawy",true,0,2015,0,"2014-12-19","2015-01-01"]
[2015,1,"KRZYŻANÓW",1002052,2,null,600,11.3,"[11.3.1] + [11.3.2]"," Wydatki objęte limitem, o którym mowa w art. 226 ust. 3 pkt 4 ustawy",true,1,2016,1405000,"2014-12-19","2015-01-01"]
[2015,1,"KRZYŻANÓW",1002052,2,null,930,"14.3.3",null,"  wypłaty z tytułu wymagalnych poręczeń i gwarancji",true,1,2016,0,"2014-12-19","2015-01-01"]
[2015,1,"KRZYŻANÓW",1002052,2,null,332,"5.1.1.1",null,"   kwota przypadających na dany rok kwot ustawowych wyłączeń określonych w art. 243 ust. 3 ustawy",true,0,2015,0,"2014-12-19","2015-01-01"]
[2015,1,"KRZYŻANÓW",1002052,2,null,130,2.1,null," Wydatki bieżące, w tym:",true,3,2018,10030650,"2014-12-19","2015-01-01"]
[2015,1,"KRZYŻANÓW",1002052,2,null,300,5,"[5.1] + [5.2]","Rozchody budżetu",false,0,2015,169179.6,"2014-12-19","2015-01-01"]
[2015,1,"KRZYŻANÓW",1002052,2,null,332,"5.1.1.1",null,"   kwota przypadających na dany rok kwot ustawowych wyłączeń określonych w art. 243 ust. 3 ustawy",true,2,2017,0,"2014-12-19","2015-01-01"]
[2015,1,"KRZYŻANÓW",1002052,2,null,230,"4.1.1",null,"  w tym na pokrycie deficytu budżetu",false,3,2018,0,"2014-12-19","2015-01-01"]
[2015,1,"KRZYŻANÓW",1002052,2,null,420,8.1,"[1.1] - [2.1]"," Różnica między dochodami bieżącymi a  wydatkami bieżącymi",false,2,2017,3427269.6,"2014-12-19","2015-01-01"]
[2015,1,"KRZYŻANÓW",1002052,2,null,980,15.2,null," Wydatki bieżące z tytułu świadczenia emitenta należnego obligatariuszom,  nieuwzględniane  w limicie spłaty zobowiązań, o którym mowa w art. 243 ustawy",true,0,2015,0,"2014-12-19","2015-01-01"]
[2015,1,"KRZYŻANÓW",1002052,2,null,980,15.2,null," Wydatki bieżące z tytułu świadczenia emitenta należnego obligatariuszom,  nieuwzględniane  w limicie spłaty zobowiązań, o którym mowa w art. 243 ustawy",true,1,2016,0,"2014-12-19","2015-01-01"]
[2015,1,"KRZYŻANÓW",1002052,2,null,720,"12.2.1.1",null,"    - w tym środki określone w art. 5 ust. 1 pkt 2 ustawy wynikające wyłącznie z zawartych umów na realizację programu, projektu lub zadania",false,3,2018,0,"2014-12-19","2015-01-01"]
[2015,1,"KRZYŻANÓW",1002052,2,null,250,"4.2.1",null,"   w tym na pokrycie deficytu budżetu",false,0,2015,0,"2014-12-19","2015-01-01"]
[2015,1,"KRZYŻANÓW",1002052,2,null,520,"9.6.1",null,"   Dopuszczalny wskaźnik spłaty zobowiązań określony w art. 243 ustawy, po uwzględnieniu ustawowych wyłączeń, obliczony w oparciu o wykonanie roku poprzedzającego pierwszy rok prognozy (wskaźnik ustalony w oparciu o średnią arytmetyczną z 3 poprzednich lat) ",true,3,2018,0.2445,"2014-12-19","2015-01-01"]
[2015,1,"KRZYŻANÓW",1002052,2,null,540,"9.7.1","[9.6.1]-[9.4]","  Informacja o spełnieniu wskaźnika spłaty zobowiązań określonego w art. 243 ustawy, po uwzględnieniu zobowiązań związku współtworzonego przez jednostkę samorządu terytorialnego oraz po uwzględnieniu ustawowych wyłączeń, obliczonego w oparciu o wykonanie roku poprzedzającego rok budżetowy",false,3,2018,2445,"2014-12-19","2015-01-01"]
[2015,1,"KRZYŻANÓW",1002052,2,null,570,11,null,"Informacje uzupełniające o wybranych rodzajach wydatków budżetowych",false,3,2018,0,"2014-12-19","2015-01-01"]
[2015,1,"KRZYŻANÓW",1002052,2,null,960,15.1,null," Środki z przedsięwzięcia gromadzone na rachunku bankowym,  w tym:",true,2,2017,0,"2014-12-19","2015-01-01"]
[2015,1,"KRZYŻANÓW",1002052,2,null,630,11.4,null," Wydatki inwestycyjne kontynuowane ",true,1,2016,1405000,"2014-12-19","2015-01-01"]
[2015,1,"KRZYŻANÓW",1002052,2,null,760,12.4,null," Wydatki majątkowe na programy, projekty lub zadania finansowane z udziałem środków, o których mowa w art. 5 ust. 1 pkt 2 i 3 ustawy",true,1,2016,0,"2014-12-19","2015-01-01"]
[2015,1,"KRZYŻANÓW",1002052,2,null,769,12.8,null," Przychody z tytułu kredytów, pożyczek, emisji papierów wartościowych powstające w związku z zawartą po dniu 1 stycznia 2013 r. umową na realizację programu, projektu lub zadania finansowanego w co najmniej 60% środkami, o których mowa w art. 5 ust. 1 pkt 2 ustawy",true,0,2015,0,"2014-12-19","2015-01-01"]
[2015,1,"KRZYŻANÓW",1002052,2,null,320,"5.1.1","[5.1.1.1] + [5.1.1.2] + [5.1.1.3]","  w tym łączna kwota przypadających na dany rok kwot ustawowych wyłączeń z limitu spłaty zobowiązań, o którym mowa w art. 243 ustawy, z tego:",true,1,2016,0,"2014-12-19","2015-01-01"]
[2015,1,"KRZYŻANÓW",1002052,2,null,50,"1.1.3",null,"  podatki i opłaty",true,0,2015,4676056,"2014-12-19","2015-01-01"]
[2015,1,"KRZYŻANÓW",1002052,2,null,940,14.4,null," Wynik operacji niekasowych wpływających na kwotę długu ( m.in. umorzenia, różnice kursowe)",true,0,2015,0,"2014-12-19","2015-01-01"]
[2015,1,"KRZYŻANÓW",1002052,2,null,470,9.1,"([2.1.1] + [2.1.3.1] + [5.1] ) / [1]"," Wskaźnik planowanej łącznej kwoty spłaty zobowiązań, o której mowa w art. 243 ust. 1 ustawy do dochodów, bez uwzględnienia zobowiązań związku współtworzonego przez jednostkę samorządu terytorialnego  i bez uwzględnienia ustawowych wyłączeń przypadających na dany rok.",true,2,2017,5.5500000000000001E-2,"2014-12-19","2015-01-01"]
[2015,1,"KRZYŻANÓW",1002052,2,null,767,12.7,null," Przychody z tytułu kredytów, pożyczek, emisji papierów wartościowych powstające w związku z umową na realizację programu, projektu lub zadania finansowanego z udziałem środków, o których mowa w art. 5 ust. 1 pkt 2 ustawy bez względu na stopień finansowania tymi środkami ",true,0,2015,0,"2014-12-19","2015-01-01"]
[2015,1,"KRZYŻANÓW",1002052,2,null,900,14.3,null," Wydatki zmniejszające dług, w tym",true,2,2017,0,"2014-12-19","2015-01-01"]
[2015,1,"KRZYŻANÓW",1002052,2,null,180,"2.1.3.1",null,"   odsetki i dyskonto określone w art. 243 ust. 1 ustawy, w tym:",false,3,2018,0,"2014-12-19","2015-01-01"]
[2015,1,"KRZYŻANÓW",1002052,2,null,910,"14.3.1",null,"  spłata zobowiązań wymagalnych z lat poprzednich, innych niż w pkt 14.3.3",true,0,2015,0,"2014-12-19","2015-01-01"]
[2015,1,"KRZYŻANÓW",1002052,2,null,200,3,"[1] -[2]","Wynik budżetu",false,3,2018,0,"2014-12-19","2015-01-01"]
[2015,1,"KRZYŻANÓW",1002052,2,null,320,"5.1.1","[5.1.1.1] + [5.1.1.2] + [5.1.1.3]","  w tym łączna kwota przypadających na dany rok kwot ustawowych wyłączeń z limitu spłaty zobowiązań, o którym mowa w art. 243 ustawy, z tego:",true,0,2015,0,"2014-12-19","2015-01-01"]
[2015,1,"KRZYŻANÓW",1002052,2,null,700,12.2,null," Dochody majątkowe  na programy, projekty lub zadania finansowane z udziałem środków, o których mowa w art. 5 ust. 1 pkt 2 i 3 ustawy",false,2,2017,0,"2014-12-19","2015-01-01"]
[2015,1,"KRZYŻANÓW",1002052,2,null,710,"12.2.1",null,"   -  w tym środki określone w art. 5 ust. 1 pkt 2 ustawy",false,2,2017,0,"2014-12-19","2015-01-01"]
[2015,1,"KRZYŻANÓW",1002052,2,null,250,"4.2.1",null,"   w tym na pokrycie deficytu budżetu",false,3,2018,0,"2014-12-19","2015-01-01"]
[2015,1,"KRZYŻANÓW",1002052,2,null,480,9.1999999999999993,"( ([2.1.1]-[2.1.1.1])+([2.1.3.1]-[2.1.3.1.1]-[2.1.3.1.2])+([5.1]-[5.1.1]) )/([1]-[15.1.1])"," Wskaźnik planowanej łącznej kwoty spłaty zobowiązań, o której mowa w art. 243 ust. 1 ustawy do dochodów, bez uwzględnienia zobowiązań związku współtworzonego przez jednostkę samorządu terytorialnego, po uwzględnieniu ustawowych wyłączeń przypadających na dany rok.",false,3,2018,0,"2014-12-19","2015-01-01"]
[2015,1,"KRZYŻANÓW",1002052,2,null,590,11.2,null," Wydatki związane z funkcjonowaniem organów jednostki samorządu terytorialnego",true,3,2018,1648330,"2014-12-19","2015-01-01"]
[2015,1,"KRZYŻANÓW",1002052,2,null,760,12.4,null," Wydatki majątkowe na programy, projekty lub zadania finansowane z udziałem środków, o których mowa w art. 5 ust. 1 pkt 2 i 3 ustawy",true,2,2017,0,"2014-12-19","2015-01-01"]
[2015,1,"KRZYŻANÓW",1002052,2,null,184,"2.1.3.1.2",null,"    odsetki i dyskonto podlegające wyłączeniu z limitu spłaty zobowiązań, o którym mowa w art. 243 ustawy, z tytułu zobowiązań  zaciągniętych na wkład krajowy",false,3,2018,0,"2014-12-19","2015-01-01"]
[2015,1,"KRZYŻANÓW",1002052,2,null,990,16,null,"Stopnie niezachowania relacji określonych w art. 242-244 ustawy w przypadku określonym w @par16_1 ustawy",true,1,2016,0,"2014-12-19","2015-01-01"]
[2015,1,"KRZYŻANÓW",1002052,2,null,560,10.1,null," Spłaty kredytów, pożyczek i wykup papierów wartościowych",false,3,2018,0,"2014-12-19","2015-01-01"]
[2015,1,"KRZYŻANÓW",1002052,2,null,720,"12.2.1.1",null,"    - w tym środki określone w art. 5 ust. 1 pkt 2 ustawy wynikające wyłącznie z zawartych umów na realizację programu, projektu lub zadania",false,0,2015,0,"2014-12-19","2015-01-01"]
[2015,1,"KRZYŻANÓW",1002052,2,null,290,"4.4.1",null,"   w tym na pokrycie deficytu budżetu",false,0,2015,0,"2014-12-19","2015-01-01"]
[2015,1,"KRZYŻANÓW",1002052,2,null,50,"1.1.3",null,"  podatki i opłaty",true,3,2018,5960256,"2014-12-19","2015-01-01"]
[2015,1,"KRZYŻANÓW",1002052,2,null,1000,16.100000000000001,null," Stopień niezachowania relacji zrównoważenia wydatków bieżących, o której mowa w poz. 8.2.",true,3,2018,0,"2014-12-19","2015-01-01"]
[2015,1,"KRZYŻANÓW",1002052,2,null,300,5,"[5.1] + [5.2]","Rozchody budżetu",false,1,2016,701400,"2014-12-19","2015-01-01"]
[2015,1,"KRZYŻANÓW",1002052,2,null,530,9.6999999999999993,"[9.6]-[9.4]"," Informacja o spełnieniu wskaźnika spłaty zobowiązań określonego w art. 243 ustawy, po uwzględnieniu zobowiązań związku współtworzonego przez jednostkę samorządu terytorialnego oraz po uwzględnieniu ustawowych wyłączeń, obliczonego w oparciu o plan 3 kwartałów roku poprzedzającego rok budżetowy",false,0,2015,1860,"2014-12-19","2015-01-01"]
[2015,1,"KRZYŻANÓW",1002052,2,null,580,11.1,null," Wydatki bieżące na wynagrodzenia i składki od nich naliczane",false,1,2016,4519114,"2014-12-19","2015-01-01"]
[2015,1,"KRZYŻANÓW",1002052,2,null,470,9.1,"([2.1.1] + [2.1.3.1] + [5.1] ) / [1]"," Wskaźnik planowanej łącznej kwoty spłaty zobowiązań, o której mowa w art. 243 ust. 1 ustawy do dochodów, bez uwzględnienia zobowiązań związku współtworzonego przez jednostkę samorządu terytorialnego  i bez uwzględnienia ustawowych wyłączeń przypadających na dany rok.",true,0,2015,2.2599999999999999E-2,"2014-12-19","2015-01-01"]
[2015,1,"KRZYŻANÓW",1002052,2,null,580,11.1,null," Wydatki bieżące na wynagrodzenia i składki od nich naliczane",false,2,2017,4614015,"2014-12-19","2015-01-01"]
[2015,1,"KRZYŻANÓW",1002052,2,null,630,11.4,null," Wydatki inwestycyjne kontynuowane ",true,3,2018,0,"2014-12-19","2015-01-01"]
[2015,1,"KRZYŻANÓW",1002052,2,null,260,4.3,null,"  Kredyty, pożyczki, emisja papierów wartościowych",true,3,2018,0,"2014-12-19","2015-01-01"]
[2015,1,"KRZYŻANÓW",1002052,2,null,10,1,"[1.1] + [1.2]","Dochody ogółem",true,3,2018,13379740,"2014-12-19","2015-01-01"]
[2015,1,"KRZYŻANÓW",1002052,2,null,1020,16.3,null," Stopień niezachowania wskaźnika spłaty zobowiązań, o którym mowa w poz. 9.7.1.",true,0,2015,0,"2014-12-19","2015-01-01"]
[2015,1,"KRZYŻANÓW",1002052,2,null,530,9.6999999999999993,"[9.6]-[9.4]"," Informacja o spełnieniu wskaźnika spłaty zobowiązań określonego w art. 243 ustawy, po uwzględnieniu zobowiązań związku współtworzonego przez jednostkę samorządu terytorialnego oraz po uwzględnieniu ustawowych wyłączeń, obliczonego w oparciu o plan 3 kwartałów roku poprzedzającego rok budżetowy",false,3,2018,2445,"2014-12-19","2015-01-01"]
[2015,1,"KRZYŻANÓW",1002052,2,null,520,"9.6.1",null,"   Dopuszczalny wskaźnik spłaty zobowiązań określony w art. 243 ustawy, po uwzględnieniu ustawowych wyłączeń, obliczony w oparciu o wykonanie roku poprzedzającego pierwszy rok prognozy (wskaźnik ustalony w oparciu o średnią arytmetyczną z 3 poprzednich lat) ",true,1,2016,0.1905,"2014-12-19","2015-01-01"]
[2015,1,"KRZYŻANÓW",1002052,2,null,508,9.5,"(([1.1] - [15.1.1])+[1.2.1] - ([2.1]-[2.1.2]-[15.2]))/ ([1]-[15.1.1])"," Wskaźnik dochodów bieżących powiększonych o dochody ze sprzedaży majątku oraz pomniejszonych o wydatki bieżące, do dochodów budżetu, ustalony dla danego roku (wskaźnik jednoroczny)",false,3,2018,0.25030000000000002,"2014-12-19","2015-01-01"]
[2015,1,"KRZYŻANÓW",1002052,2,null,850,13.6,null," Wydatki na spłatę zobowiązań samodzielnego publicznego zakładu opieki zdrowotnej przejętych do końca 2011 r. na podstawie przepisów o zakładach opieki zdrowotnej",true,0,2015,0,"2014-12-19","2015-01-01"]
[2015,1,"KRZYŻANÓW",1002052,2,null,336,"5.1.1.3",null,"   kwota przypadających na dany rok kwot ustawowych wyłączeń innych niż określone w art. 243 ustawy",true,0,2015,0,"2014-12-19","2015-01-01"]
[2015,1,"KRZYŻANÓW",1002052,2,null,430,8.1999999999999993,"[1.1] + [4.1] + [4.2] - (  [2.1] - [2.1.2]  )"," Różnica między dochodami bieżącymi, skorygowanymi o środki a wydatkami bieżącymi, pomniejszonymi  o wydatki",false,1,2016,3461390,"2014-12-19","2015-01-01"]
[2015,1,"KRZYŻANÓW",1002052,2,null,680,"12.1.1",null,"  -  w tym środki określone w art. 5 ust. 1 pkt 2 ustawy",true,2,2017,0,"2014-12-19","2015-01-01"]
[2015,1,"KRZYŻANÓW",1002052,2,null,790,13,null,"Kwoty dotyczące przejęcia i spłaty zobowiązań po samodzielnych publicznych zakładach opieki zdrowotnej oraz pokrycia ujemnego wyniku ",true,2,2017,0,"2014-12-19","2015-01-01"]
[2015,1,"KRZYŻANÓW",1002052,2,null,770,"12.8.1",null,"  w tym w związku z już zawartą umową na realizację programu, projektu lub zadania",true,0,2015,0,"2014-12-19","2015-01-01"]
[2015,1,"KRZYŻANÓW",1002052,2,null,800,13.1,null," Kwota zobowiązań wynikających z przejęcia przez jednostkę samorządu terytorialnego zobowiązań po likwidowanych i przekształcanych samodzielnych zakładach opieki zdrowotnej",true,3,2018,0,"2014-12-19","2015-01-01"]
[2015,1,"KRZYŻANÓW",1002052,2,null,10,1,"[1.1] + [1.2]","Dochody ogółem",true,2,2017,13247270,"2014-12-19","2015-01-01"]
[2015,1,"KRZYŻANÓW",1002052,2,null,740,"12.3.1",null,"  -  w tym finansowane środkami określonymi w art. 5 ust. 1 pkt 2 ustawy ",false,1,2016,0,"2014-12-19","2015-01-01"]
[2015,1,"KRZYŻANÓW",1002052,2,null,830,13.4,null," Wydatki na spłatę przejętych zobowiązań samodzielnego publicznego zakładu opieki zdrowotnej przekształconego na zasadach określonych w przepisach  o działalności leczniczej",true,0,2015,0,"2014-12-19","2015-01-01"]
[2015,1,"KRZYŻANÓW",1002052,2,null,130,2.1,null," Wydatki bieżące, w tym:",true,2,2017,9820000.4000000004,"2014-12-19","2015-01-01"]
[2015,1,"KRZYŻANÓW",1002052,2,null,200,3,"[1] -[2]","Wynik budżetu",false,1,2016,701400,"2014-12-19","2015-01-01"]
[2015,1,"KRZYŻANÓW",1002052,2,null,620,"11.3.2",null,"   majątkowe",true,2,2017,0,"2014-12-19","2015-01-01"]
[2015,1,"KRZYŻANÓW",1002052,2,null,1010,16.2,null," Stopień niezachowania wskaźnika spłaty zobowiązań, o którym mowa w poz. 9.7.",true,2,2017,0,"2014-12-19","2015-01-01"]
[2015,1,"KRZYŻANÓW",1002052,2,null,670,12.1,null," Dochody bieżące  na programy, projekty lub zadania finansowane z udziałem środków, o których mowa w art. 5 ust. 1 pkt 2 i 3 ustawy",true,2,2017,0,"2014-12-19","2015-01-01"]
[2015,1,"KRZYŻANÓW",1002052,2,null,630,11.4,null," Wydatki inwestycyjne kontynuowane ",true,2,2017,0,"2014-12-19","2015-01-01"]
[2015,1,"KRZYŻANÓW",1002052,2,null,610,"11.3.1",null,"   bieżące",true,3,2018,0,"2014-12-19","2015-01-01"]
[2015,1,"KRZYŻANÓW",1002052,2,null,70,"1.1.4",null,"  z subwencji ogólnej",true,3,2018,3979813,"2014-12-19","2015-01-01"]
[2015,1,"KRZYŻANÓW",1002052,2,null,290,"4.4.1",null,"   w tym na pokrycie deficytu budżetu",false,1,2016,0,"2014-12-19","2015-01-01"]
[2015,1,"KRZYŻANÓW",1002052,2,null,766,"12.6.1",null,"  w tym w związku z już zawartą umową na realizację programu, projektu lub zadania",true,3,2018,0,"2014-12-19","2015-01-01"]
[2015,1,"KRZYŻANÓW",1002052,2,null,490,9.3000000000000007,null," Kwota zobowiązań związku współtworzonego przez jednostkę samorządu terytorialnego przypadających do spłaty w danym roku budżetowym, podlegająca doliczeniu zgodnie z art. 244 ustawy",true,0,2015,0,"2014-12-19","2015-01-01"]
[2015,1,"KRZYŻANÓW",1002052,2,null,1020,16.3,null," Stopień niezachowania wskaźnika spłaty zobowiązań, o którym mowa w poz. 9.7.1.",true,2,2017,0,"2014-12-19","2015-01-01"]
[2015,1,"KRZYŻANÓW",1002052,2,null,430,8.1999999999999993,"[1.1] + [4.1] + [4.2] - (  [2.1] - [2.1.2]  )"," Różnica między dochodami bieżącymi, skorygowanymi o środki a wydatkami bieżącymi, pomniejszonymi  o wydatki",false,0,2015,2508107,"2014-12-19","2015-01-01"]
[2015,1,"KRZYŻANÓW",1002052,2,null,769,12.8,null," Przychody z tytułu kredytów, pożyczek, emisji papierów wartościowych powstające w związku z zawartą po dniu 1 stycznia 2013 r. umową na realizację programu, projektu lub zadania finansowanego w co najmniej 60% środkami, o których mowa w art. 5 ust. 1 pkt 2 ustawy",true,3,2018,0,"2014-12-19","2015-01-01"]
[2015,1,"KRZYŻANÓW",1002052,2,null,60,"1.1.3.1",null,"   z podatku od nieruchomości",true,2,2017,2696034,"2014-12-19","2015-01-01"]
[2015,1,"KRZYŻANÓW",1002052,2,null,570,11,null,"Informacje uzupełniające o wybranych rodzajach wydatków budżetowych",false,0,2015,0,"2014-12-19","2015-01-01"]
[2015,1,"KRZYŻANÓW",1002052,2,null,310,5.0999999999999996,null," Spłaty rat kapitałowych kredytów i pożyczek oraz wykup papierów wartościowych",true,0,2015,169179.6,"2014-12-19","2015-01-01"]
[2015,1,"KRZYŻANÓW",1002052,2,null,870,14,null,"Dane uzupełniające o długu i jego spłacie",true,2,2017,0,"2014-12-19","2015-01-01"]
[2015,1,"KRZYŻANÓW",1002052,2,null,560,10.1,null," Spłaty kredytów, pożyczek i wykup papierów wartościowych",false,0,2015,0,"2014-12-19","2015-01-01"]
[2015,1,"KRZYŻANÓW",1002052,2,null,767,12.7,null," Przychody z tytułu kredytów, pożyczek, emisji papierów wartościowych powstające w związku z umową na realizację programu, projektu lub zadania finansowanego z udziałem środków, o których mowa w art. 5 ust. 1 pkt 2 ustawy bez względu na stopień finansowania tymi środkami ",true,2,2017,0,"2014-12-19","2015-01-01"]
[2015,1,"KRZYŻANÓW",1002052,2,null,280,4.4000000000000004,null," Inne przychody niezwiązane z zaciągnięciem długu",false,0,2015,0,"2014-12-19","2015-01-01"]
[2015,1,"KRZYŻANÓW",1002052,2,null,950,15,null,"Dane dotyczące emitowanych obligacji przychodowych",true,1,2016,0,"2014-12-19","2015-01-01"]
[2015,1,"KRZYŻANÓW",1002052,2,null,210,4,"[4.1] + [4.2] + [4.3] + [4.4]","Przychody budżetu",false,0,2015,1402787.6,"2014-12-19","2015-01-01"]
[2015,1,"KRZYŻANÓW",1002052,2,null,260,4.3,null,"  Kredyty, pożyczki, emisja papierów wartościowych",true,1,2016,0,"2014-12-19","2015-01-01"]
[2015,1,"KRZYŻANÓW",1002052,2,null,480,9.1999999999999993,"( ([2.1.1]-[2.1.1.1])+([2.1.3.1]-[2.1.3.1.1]-[2.1.3.1.2])+([5.1]-[5.1.1]) )/([1]-[15.1.1])"," Wskaźnik planowanej łącznej kwoty spłaty zobowiązań, o której mowa w art. 243 ust. 1 ustawy do dochodów, bez uwzględnienia zobowiązań związku współtworzonego przez jednostkę samorządu terytorialnego, po uwzględnieniu ustawowych wyłączeń przypadających na dany rok.",false,2,2017,5.5500000000000001E-2,"2014-12-19","2015-01-01"]
[2015,1,"KRZYŻANÓW",1002052,2,null,350,6,null,"Kwota długu",true,3,2018,0,"2014-12-19","2015-01-01"]
[2015,1,"KRZYŻANÓW",1002052,2,null,240,4.2,null," Wolne środki, o których mowa w art. 217 ust.2 pkt 6 ustawy",false,1,2016,0,"2014-12-19","2015-01-01"]
[2015,1,"KRZYŻANÓW",1002052,2,null,220,4.0999999999999996,null," Nadwyżka budżetowa z lat ubiegłych",false,0,2015,0,"2014-12-19","2015-01-01"]
[2015,1,"KRZYŻANÓW",1002052,2,null,740,"12.3.1",null,"  -  w tym finansowane środkami określonymi w art. 5 ust. 1 pkt 2 ustawy ",false,0,2015,0,"2014-12-19","2015-01-01"]
[2015,1,"KRZYŻANÓW",1002052,2,null,970,"15.1.1",null,"  środki na zaspokojenie roszczeń obligatariuszy",true,0,2015,0,"2014-12-19","2015-01-01"]
[2015,1,"KRZYŻANÓW",1002052,2,null,200,3,"[1] -[2]","Wynik budżetu",false,2,2017,701387.6,"2014-12-19","2015-01-01"]
[2015,1,"KRZYŻANÓW",1002052,2,null,930,"14.3.3",null,"  wypłaty z tytułu wymagalnych poręczeń i gwarancji",true,0,2015,0,"2014-12-19","2015-01-01"]
[2015,1,"KRZYŻANÓW",1002052,2,null,590,11.2,null," Wydatki związane z funkcjonowaniem organów jednostki samorządu terytorialnego",true,1,2016,1575050,"2014-12-19","2015-01-01"]
[2015,1,"KRZYŻANÓW",1002052,2,null,260,4.3,null,"  Kredyty, pożyczki, emisja papierów wartościowych",true,0,2015,1402787.6,"2014-12-19","2015-01-01"]
[2015,1,"KRZYŻANÓW",1002052,2,null,280,4.4000000000000004,null," Inne przychody niezwiązane z zaciągnięciem długu",false,3,2018,0,"2014-12-19","2015-01-01"]
[2015,1,"KRZYŻANÓW",1002052,2,null,110,"1.2.2",null,"  z tytułu dotacji oraz środków przeznaczonych na inwestycje",true,3,2018,0,"2014-12-19","2015-01-01"]
[2015,1,"KRZYŻANÓW",1002052,2,null,470,9.1,"([2.1.1] + [2.1.3.1] + [5.1] ) / [1]"," Wskaźnik planowanej łącznej kwoty spłaty zobowiązań, o której mowa w art. 243 ust. 1 ustawy do dochodów, bez uwzględnienia zobowiązań związku współtworzonego przez jednostkę samorządu terytorialnego  i bez uwzględnienia ustawowych wyłączeń przypadających na dany rok.",true,1,2016,5.8799999999999998E-2,"2014-12-19","2015-01-01"]
[2015,1,"KRZYŻANÓW",1002052,2,null,765,12.6,null," Wydatki na wkład krajowy w związku z zawartą po dniu 1 stycznia 2013 r. umową na realizację programu, projektu lub zadania finansowanego w co najmniej 60% środkami, o których mowa w art. 5 ust. 1 pkt 2 ustawy",true,2,2017,0,"2014-12-19","2015-01-01"]
[2015,1,"KRZYŻANÓW",1002052,2,null,210,4,"[4.1] + [4.2] + [4.3] + [4.4]","Przychody budżetu",false,3,2018,0,"2014-12-19","2015-01-01"]
[2015,1,"KRZYŻANÓW",1002052,2,null,70,"1.1.4",null,"  z subwencji ogólnej",true,1,2016,3901395,"2014-12-19","2015-01-01"]
[2015,1,"KRZYŻANÓW",1002052,2,null,440,9,null,"Wskaźnik spłaty zobowiązań",false,1,2016,0,"2014-12-19","2015-01-01"]
[2015,1,"KRZYŻANÓW",1002052,2,null,830,13.4,null," Wydatki na spłatę przejętych zobowiązań samodzielnego publicznego zakładu opieki zdrowotnej przekształconego na zasadach określonych w przepisach  o działalności leczniczej",true,3,2018,0,"2014-12-19","2015-01-01"]
[2015,1,"KRZYŻANÓW",1002052,2,null,334,"5.1.1.2",null,"   kwota przypadających na dany rok kwot ustawowych wyłączeń określonych w art. 243 ust. 3a ustawy",true,3,2018,0,"2014-12-19","2015-01-01"]
[2015,1,"KRZYŻANÓW",1002052,2,null,1010,16.2,null," Stopień niezachowania wskaźnika spłaty zobowiązań, o którym mowa w poz. 9.7.",true,3,2018,0,"2014-12-19","2015-01-01"]
[2015,1,"KRZYŻANÓW",1002052,2,null,200,3,"[1] -[2]","Wynik budżetu",false,0,2015,-1233608,"2014-12-19","2015-01-01"]
[2015,1,"KRZYŻANÓW",1002052,2,null,680,"12.1.1",null,"  -  w tym środki określone w art. 5 ust. 1 pkt 2 ustawy",true,0,2015,0,"2014-12-19","2015-01-01"]
[2015,1,"KRZYŻANÓW",1002052,2,null,630,11.4,null," Wydatki inwestycyjne kontynuowane ",true,0,2015,850000,"2014-12-19","2015-01-01"]
[2015,1,"KRZYŻANÓW",1002052,2,null,90,1.2,null,"  Dochody majątkowe, w tym",true,1,2016,0,"2014-12-19","2015-01-01"]
[2015,1,"KRZYŻANÓW",1002052,2,null,170,"2.1.3",null,"  wydatki na obsługę długu, w tym:",true,2,2017,34000,"2014-12-19","2015-01-01"]
[2015,1,"KRZYŻANÓW",1002052,2,null,470,9.1,"([2.1.1] + [2.1.3.1] + [5.1] ) / [1]"," Wskaźnik planowanej łącznej kwoty spłaty zobowiązań, o której mowa w art. 243 ust. 1 ustawy do dochodów, bez uwzględnienia zobowiązań związku współtworzonego przez jednostkę samorządu terytorialnego  i bez uwzględnienia ustawowych wyłączeń przypadających na dany rok.",true,3,2018,0,"2014-12-19","2015-01-01"]
[2015,1,"KRZYŻANÓW",1002052,2,null,336,"5.1.1.3",null,"   kwota przypadających na dany rok kwot ustawowych wyłączeń innych niż określone w art. 243 ustawy",true,2,2017,0,"2014-12-19","2015-01-01"]
[2015,1,"KRZYŻANÓW",1002052,2,null,720,"12.2.1.1",null,"    - w tym środki określone w art. 5 ust. 1 pkt 2 ustawy wynikające wyłącznie z zawartych umów na realizację programu, projektu lub zadania",false,2,2017,0,"2014-12-19","2015-01-01"]
[2015,1,"KRZYŻANÓW",1002052,2,null,490,9.3000000000000007,null," Kwota zobowiązań związku współtworzonego przez jednostkę samorządu terytorialnego przypadających do spłaty w danym roku budżetowym, podlegająca doliczeniu zgodnie z art. 244 ustawy",true,2,2017,0,"2014-12-19","2015-01-01"]
[2015,1,"KRZYŻANÓW",1002052,2,null,150,"2.1.1.1",null,"   w tym: gwarancje i poręczenia podlegające wyłączeniu z limitu spłaty zobowiązań, o którym mowa w art. 243 ustawy",true,2,2017,0,"2014-12-19","2015-01-01"]
[2015,1,"KRZYŻANÓW",1002052,2,null,710,"12.2.1",null,"   -  w tym środki określone w art. 5 ust. 1 pkt 2 ustawy",false,3,2018,0,"2014-12-19","2015-01-01"]
[2015,1,"KRZYŻANÓW",1002052,2,null,820,13.3,null," Wysokość zobowiązań podlegających umorzeniu, o którym mowa w art. 190 ustawy o działalności leczniczej",true,1,2016,0,"2014-12-19","2015-01-01"]
[2015,1,"KRZYŻANÓW",1002052,2,null,730,12.3,null," Wydatki bieżące na programy, projekty lub zadania finansowane z udziałem środków, o których mowa w art. 5 ust. 1 pkt 2 i 3 ustawy",false,0,2015,0,"2014-12-19","2015-01-01"]
[2015,1,"KRZYŻANÓW",1002052,2,null,60,"1.1.3.1",null,"   z podatku od nieruchomości",true,3,2018,2723000,"2014-12-19","2015-01-01"]
[2015,1,"KRZYŻANÓW",1002052,2,null,340,5.2,null," Inne rozchody niezwiązane ze spłatą długu",false,3,2018,0,"2014-12-19","2015-01-01"]
[2015,1,"KRZYŻANÓW",1002052,2,null,50,"1.1.3",null,"  podatki i opłaty",true,1,2016,5842816,"2014-12-19","2015-01-01"]
[2015,1,"KRZYŻANÓW",1002052,2,null,980,15.2,null," Wydatki bieżące z tytułu świadczenia emitenta należnego obligatariuszom,  nieuwzględniane  w limicie spłaty zobowiązań, o którym mowa w art. 243 ustawy",true,2,2017,0,"2014-12-19","2015-01-01"]
[2015,1,"KRZYŻANÓW",1002052,2,null,764,"12.5.1",null,"  w tym w związku z już zawartą umową na realizację programu, projektu lub zadania",true,3,2018,0,"2014-12-19","2015-01-01"]
[2015,1,"KRZYŻANÓW",1002052,2,null,590,11.2,null," Wydatki związane z funkcjonowaniem organów jednostki samorządu terytorialnego",true,0,2015,1539639,"2014-12-19","2015-01-01"]
[2015,1,"KRZYŻANÓW",1002052,2,null,870,14,null,"Dane uzupełniające o długu i jego spłacie",true,0,2015,0,"2014-12-19","2015-01-01"]
[2015,1,"KRZYŻANÓW",1002052,2,null,510,9.6,null," Dopuszczalny wskaźnik spłaty zobowiązań określony w art. 243 ustawy, po uwzględnieniu ustawowych wyłączeń , obliczony w oparciu o plan 3 kwartału roku poprzedzającego pierwszy rok prognozy (wskaźnik ustalony w oparciu o średnią arytmetyczną z 3 poprzednich lat) ",true,3,2018,0.2445,"2014-12-19","2015-01-01"]
[2015,1,"KRZYŻANÓW",1002052,2,null,600,11.3,"[11.3.1] + [11.3.2]"," Wydatki objęte limitem, o którym mowa w art. 226 ust. 3 pkt 4 ustawy",true,0,2015,945000,"2014-12-19","2015-01-01"]
[2015,1,"KRZYŻANÓW",1002052,2,null,80,"1.1.5",null,"  z tytułu dotacji i środków przeznaczonych na cele bieżące",true,1,2016,1273753,"2014-12-19","2015-01-01"]
[2015,1,"KRZYŻANÓW",1002052,2,null,184,"2.1.3.1.2",null,"    odsetki i dyskonto podlegające wyłączeniu z limitu spłaty zobowiązań, o którym mowa w art. 243 ustawy, z tytułu zobowiązań  zaciągniętych na wkład krajowy",false,2,2017,0,"2014-12-19","2015-01-01"]
[2015,1,"KRZYŻANÓW",1002052,2,null,660,12,null,"Finansowanie programów, projektów lub zadań realizowanych z udziałem środków, o których mowa w art. 5 ust. 1 pkt 2 i 3 ustawy",true,2,2017,0,"2014-12-19","2015-01-01"]
[2015,1,"KRZYŻANÓW",1002052,2,null,184,"2.1.3.1.2",null,"    odsetki i dyskonto podlegające wyłączeniu z limitu spłaty zobowiązań, o którym mowa w art. 243 ustawy, z tytułu zobowiązań  zaciągniętych na wkład krajowy",false,1,2016,0,"2014-12-19","2015-01-01"]
[2015,1,"KRZYŻANÓW",1002052,2,null,140,"2.1.1",null,"  z tytułu poręczeń i gwarancji",true,1,2016,0,"2014-12-19","2015-01-01"]
[2015,1,"KRZYŻANÓW",1002052,2,null,40,"1.1.2",null,"  dochody z tytułu udziału we wpływach z podatku dochodowego od osób prawnych",true,3,2018,2000,"2014-12-19","2015-01-01"]
[2015,1,"KRZYŻANÓW",1002052,2,null,30,"1.1.1",null,"  dochody z tytułu udziału we wpływach z podatku dochodowego od osób fizycznych",true,0,2015,1418820,"2014-12-19","2015-01-01"]
[2015,1,"KRZYŻANÓW",1002052,2,null,508,9.5,"(([1.1] - [15.1.1])+[1.2.1] - ([2.1]-[2.1.2]-[15.2]))/ ([1]-[15.1.1])"," Wskaźnik dochodów bieżących powiększonych o dochody ze sprzedaży majątku oraz pomniejszonych o wydatki bieżące, do dochodów budżetu, ustalony dla danego roku (wskaźnik jednoroczny)",false,2,2017,0.25869999999999999,"2014-12-19","2015-01-01"]
[2015,1,"KRZYŻANÓW",1002052,2,null,560,10.1,null," Spłaty kredytów, pożyczek i wykup papierów wartościowych",false,2,2017,701387.6,"2014-12-19","2015-01-01"]
[2015,1,"KRZYŻANÓW",1002052,2,null,270,"4.3.1",null,"   w tym na pokrycie deficytu budżetu",true,1,2016,0,"2014-12-19","2015-01-01"]
[2015,1,"KRZYŻANÓW",1002052,2,null,170,"2.1.3",null,"  wydatki na obsługę długu, w tym:",true,0,2015,100000,"2014-12-19","2015-01-01"]
[2015,1,"KRZYŻANÓW",1002052,2,null,410,8,null,"Relacja zrównoważenia wydatków bieżących, o której mowa w art. 242 ustawy",true,3,2018,0,"2014-12-19","2015-01-01"]
[2015,1,"KRZYŻANÓW",1002052,2,null,530,9.6999999999999993,"[9.6]-[9.4]"," Informacja o spełnieniu wskaźnika spłaty zobowiązań określonego w art. 243 ustawy, po uwzględnieniu zobowiązań związku współtworzonego przez jednostkę samorządu terytorialnego oraz po uwzględnieniu ustawowych wyłączeń, obliczonego w oparciu o plan 3 kwartałów roku poprzedzającego rok budżetowy",false,1,2016,1330,"2014-12-19","2015-01-01"]
[2015,1,"KRZYŻANÓW",1002052,2,null,990,16,null,"Stopnie niezachowania relacji określonych w art. 242-244 ustawy w przypadku określonym w @par16_1 ustawy",true,3,2018,0,"2014-12-19","2015-01-01"]
[2015,1,"KRZYŻANÓW",1002052,2,null,230,"4.1.1",null,"  w tym na pokrycie deficytu budżetu",false,0,2015,0,"2014-12-19","2015-01-01"]
[2015,1,"KRZYŻANÓW",1002052,2,null,761,"12.4.1",null,"  -  w tym finansowane środkami określonymi w art. 5 ust. 1 pkt 2 ustawy",true,3,2018,0,"2014-12-19","2015-01-01"]
[2015,1,"KRZYŻANÓW",1002052,2,null,660,12,null,"Finansowanie programów, projektów lub zadań realizowanych z udziałem środków, o których mowa w art. 5 ust. 1 pkt 2 i 3 ustawy",true,0,2015,0,"2014-12-19","2015-01-01"]
[2015,1,"KRZYŻANÓW",1002052,2,null,762,"12.4.2",null,"  Wydatki majątkowe na realizację programu, projektu lub zadania wynikające wyłącznie z zawartych umów z podmiotem dysponującym środkami, o których mowa w art. 5 ust. 1 pkt 2 ustawy ",true,3,2018,0,"2014-12-19","2015-01-01"]
[2015,1,"KRZYŻANÓW",1002052,2,null,410,8,null,"Relacja zrównoważenia wydatków bieżących, o której mowa w art. 242 ustawy",true,2,2017,0,"2014-12-19","2015-01-01"]
[2015,1,"KRZYŻANÓW",1002052,2,null,190,2.2000000000000002,null," Wydatki majątkowe",false,1,2016,2759990,"2014-12-19","2015-01-01"]
[2015,1,"KRZYŻANÓW",1002052,2,null,640,11.5,null," Nowe wydatki inwestycyjne",true,3,2018,3349090,"2014-12-19","2015-01-01"]
[2015,1,"KRZYŻANÓW",1002052,2,null,400,7,null,"Kwota zobowiązań wynikających z przejęcia przez jednostkę samorządu terytorialnego zobowiązań po likwidowanych i przekształcanych jednostkach zaliczanych do sektora  finansów publicznych",true,2,2017,0,"2014-12-19","2015-01-01"]
[2015,1,"KRZYŻANÓW",1002052,2,null,750,"12.3.2",null,"  Wydatki bieżące na realizację programu, projektu lub zadania wynikające wyłącznie z zawartych umów z podmiotem dysponującym środkami, o których mowa w art. 5 ust. 1 pkt 2 ustawy ",false,3,2018,0,"2014-12-19","2015-01-01"]
[2015,1,"KRZYŻANÓW",1002052,2,null,210,4,"[4.1] + [4.2] + [4.3] + [4.4]","Przychody budżetu",false,2,2017,0,"2014-12-19","2015-01-01"]
[2015,1,"KRZYŻANÓW",1002052,2,null,180,"2.1.3.1",null,"   odsetki i dyskonto określone w art. 243 ust. 1 ustawy, w tym:",false,0,2015,100000,"2014-12-19","2015-01-01"]
[2015,1,"KRZYŻANÓW",1002052,2,null,70,"1.1.4",null,"  z subwencji ogólnej",true,0,2015,3862767,"2014-12-19","2015-01-01"]
[2015,1,"KRZYŻANÓW",1002052,2,null,970,"15.1.1",null,"  środki na zaspokojenie roszczeń obligatariuszy",true,3,2018,0,"2014-12-19","2015-01-01"]
[2015,1,"KRZYŻANÓW",1002052,2,null,860,13.7,null," Wydatki bieżące na pokrycie ujemnego wyniku finansowego samodzielnego publicznego zakładu opieki zdrowotnej",true,2,2017,0,"2014-12-19","2015-01-01"]
[2015,1,"KRZYŻANÓW",1002052,2,null,280,4.4000000000000004,null," Inne przychody niezwiązane z zaciągnięciem długu",false,2,2017,0,"2014-12-19","2015-01-01"]
[2015,1,"KRZYŻANÓW",1002052,2,null,840,13.5,null," Wydatki na spłatę przejętych zobowiązań samodzielnego publicznego zakładu opieki zdrowotnej likwidowanego na zasadach określonych w przepisach  o działalności leczniczej",true,2,2017,0,"2014-12-19","2015-01-01"]
[2015,1,"KRZYŻANÓW",1002052,2,null,240,4.2,null," Wolne środki, o których mowa w art. 217 ust.2 pkt 6 ustawy",false,0,2015,0,"2014-12-19","2015-01-01"]
[2015,1,"KRZYŻANÓW",1002052,2,null,730,12.3,null," Wydatki bieżące na programy, projekty lub zadania finansowane z udziałem środków, o których mowa w art. 5 ust. 1 pkt 2 i 3 ustawy",false,2,2017,0,"2014-12-19","2015-01-01"]
[2015,1,"KRZYŻANÓW",1002052,2,null,850,13.6,null," Wydatki na spłatę zobowiązań samodzielnego publicznego zakładu opieki zdrowotnej przejętych do końca 2011 r. na podstawie przepisów o zakładach opieki zdrowotnej",true,3,2018,0,"2014-12-19","2015-01-01"]
[2015,1,"KRZYŻANÓW",1002052,2,null,90,1.2,null,"  Dochody majątkowe, w tym",true,2,2017,0,"2014-12-19","2015-01-01"]
[2015,1,"KRZYŻANÓW",1002052,2,null,508,9.5,"(([1.1] - [15.1.1])+[1.2.1] - ([2.1]-[2.1.2]-[15.2]))/ ([1]-[15.1.1])"," Wskaźnik dochodów bieżących powiększonych o dochody ze sprzedaży majątku oraz pomniejszonych o wydatki bieżące, do dochodów budżetu, ustalony dla danego roku (wskaźnik jednoroczny)",false,0,2015,0.21099999999999999,"2014-12-19","2015-01-01"]
[2015,1,"KRZYŻANÓW",1002052,2,null,160,"2.1.2",null,"   na spłatę przejętych zobowiązań samodzielnego publicznego zakładu opieki zdrowotnej przekształconego na zasadach określonych w przepisach  o działalności leczniczej, w wysokości w jakiej nie podlegają sfinansowaniu dotacją z budżetu państwa",true,1,2016,0,"2014-12-19","2015-01-01"]
[2015,1,"KRZYŻANÓW",1002052,2,null,620,"11.3.2",null,"   majątkowe",true,1,2016,1405000,"2014-12-19","2015-01-01"]
[2015,1,"KRZYŻANÓW",1002052,2,null,960,15.1,null," Środki z przedsięwzięcia gromadzone na rachunku bankowym,  w tym:",true,3,2018,0,"2014-12-19","2015-01-01"]
[2015,1,"KRZYŻANÓW",1002052,2,null,930,"14.3.3",null,"  wypłaty z tytułu wymagalnych poręczeń i gwarancji",true,3,2018,0,"2014-12-19","2015-01-01"]
[2015,1,"KRZYŻANÓW",1002052,2,null,770,"12.8.1",null,"  w tym w związku z już zawartą umową na realizację programu, projektu lub zadania",true,3,2018,0,"2014-12-19","2015-01-01"]
[2015,1,"KRZYŻANÓW",1002052,2,null,170,"2.1.3",null,"  wydatki na obsługę długu, w tym:",true,1,2016,70000,"2014-12-19","2015-01-01"]
[2015,1,"KRZYŻANÓW",1002052,2,null,1020,16.3,null," Stopień niezachowania wskaźnika spłaty zobowiązań, o którym mowa w poz. 9.7.1.",true,3,2018,0,"2014-12-19","2015-01-01"]
[2015,1,"KRZYŻANÓW",1002052,2,null,490,9.3000000000000007,null," Kwota zobowiązań związku współtworzonego przez jednostkę samorządu terytorialnego przypadających do spłaty w danym roku budżetowym, podlegająca doliczeniu zgodnie z art. 244 ustawy",true,1,2016,0,"2014-12-19","2015-01-01"]
[2015,1,"KRZYŻANÓW",1002052,2,null,610,"11.3.1",null,"   bieżące",true,2,2017,0,"2014-12-19","2015-01-01"]
[2015,1,"KRZYŻANÓW",1002052,2,null,150,"2.1.1.1",null,"   w tym: gwarancje i poręczenia podlegające wyłączeniu z limitu spłaty zobowiązań, o którym mowa w art. 243 ustawy",true,0,2015,0,"2014-12-19","2015-01-01"]
[2015,1,"KRZYŻANÓW",1002052,2,null,80,"1.1.5",null,"  z tytułu dotacji i środków przeznaczonych na cele bieżące",true,0,2015,1273753,"2014-12-19","2015-01-01"]
[2015,1,"KRZYŻANÓW",1002052,2,null,60,"1.1.3.1",null,"   z podatku od nieruchomości",true,0,2015,1534000,"2014-12-19","2015-01-01"]
[2015,1,"KRZYŻANÓW",1002052,2,null,10,1,"[1.1] + [1.2]","Dochody ogółem",true,1,2016,13116110,"2014-12-19","2015-01-01"]
[2015,1,"KRZYŻANÓW",1002052,2,null,310,5.0999999999999996,null," Spłaty rat kapitałowych kredytów i pożyczek oraz wykup papierów wartościowych",true,2,2017,701387.6,"2014-12-19","2015-01-01"]
[2015,1,"KRZYŻANÓW",1002052,2,null,510,9.6,null," Dopuszczalny wskaźnik spłaty zobowiązań określony w art. 243 ustawy, po uwzględnieniu ustawowych wyłączeń , obliczony w oparciu o plan 3 kwartału roku poprzedzającego pierwszy rok prognozy (wskaźnik ustalony w oparciu o średnią arytmetyczną z 3 poprzednich lat) ",true,0,2015,0.20860000000000001,"2014-12-19","2015-01-01"]
[2015,1,"KRZYŻANÓW",1002052,2,null,184,"2.1.3.1.2",null,"    odsetki i dyskonto podlegające wyłączeniu z limitu spłaty zobowiązań, o którym mowa w art. 243 ustawy, z tytułu zobowiązań  zaciągniętych na wkład krajowy",false,0,2015,0,"2014-12-19","2015-01-01"]
[2015,1,"KRZYŻANÓW",1002052,2,null,870,14,null,"Dane uzupełniające o długu i jego spłacie",true,1,2016,0,"2014-12-19","2015-01-01"]
[2015,1,"KRZYŻANÓW",1002052,2,null,510,9.6,null," Dopuszczalny wskaźnik spłaty zobowiązań określony w art. 243 ustawy, po uwzględnieniu ustawowych wyłączeń , obliczony w oparciu o plan 3 kwartału roku poprzedzającego pierwszy rok prognozy (wskaźnik ustalony w oparciu o średnią arytmetyczną z 3 poprzednich lat) ",true,2,2017,0.21190000000000001,"2014-12-19","2015-01-01"]
[2015,1,"KRZYŻANÓW",1002052,2,null,90,1.2,null,"  Dochody majątkowe, w tym",true,3,2018,0,"2014-12-19","2015-01-01"]
[2015,1,"KRZYŻANÓW",1002052,2,null,768,"12.7.1",null,"  w tym w związku z już zawartą umową na realizację programu, projektu lub zadania",true,2,2017,0,"2014-12-19","2015-01-01"]
[2015,1,"KRZYŻANÓW",1002052,2,null,580,11.1,null," Wydatki bieżące na wynagrodzenia i składki od nich naliczane",false,3,2018,4729365,"2014-12-19","2015-01-01"]
[2015,1,"KRZYŻANÓW",1002052,2,null,340,5.2,null," Inne rozchody niezwiązane ze spłatą długu",false,2,2017,0,"2014-12-19","2015-01-01"]
[2015,1,"KRZYŻANÓW",1002052,2,null,640,11.5,null," Nowe wydatki inwestycyjne",true,1,2016,1354990,"2014-12-19","2015-01-01"]
[2015,1,"KRZYŻANÓW",1002052,2,null,930,"14.3.3",null,"  wypłaty z tytułu wymagalnych poręczeń i gwarancji",true,2,2017,0,"2014-12-19","2015-01-01"]
[2015,1,"KRZYŻANÓW",1002052,2,null,762,"12.4.2",null,"  Wydatki majątkowe na realizację programu, projektu lub zadania wynikające wyłącznie z zawartych umów z podmiotem dysponującym środkami, o których mowa w art. 5 ust. 1 pkt 2 ustawy ",true,2,2017,0,"2014-12-19","2015-01-01"]
[2015,1,"KRZYŻANÓW",1002052,2,null,150,"2.1.1.1",null,"   w tym: gwarancje i poręczenia podlegające wyłączeniu z limitu spłaty zobowiązań, o którym mowa w art. 243 ustawy",true,1,2016,0,"2014-12-19","2015-01-01"]
[2015,1,"KRZYŻANÓW",1002052,2,null,670,12.1,null," Dochody bieżące  na programy, projekty lub zadania finansowane z udziałem środków, o których mowa w art. 5 ust. 1 pkt 2 i 3 ustawy",true,3,2018,0,"2014-12-19","2015-01-01"]
[2015,1,"KRZYŻANÓW",1002052,2,null,240,4.2,null," Wolne środki, o których mowa w art. 217 ust.2 pkt 6 ustawy",false,3,2018,0,"2014-12-19","2015-01-01"]
[2015,1,"KRZYŻANÓW",1002052,2,null,1000,16.100000000000001,null," Stopień niezachowania relacji zrównoważenia wydatków bieżących, o której mowa w poz. 8.2.",true,0,2015,0,"2014-12-19","2015-01-01"]
[2015,1,"KRZYŻANÓW",1002052,2,null,570,11,null,"Informacje uzupełniające o wybranych rodzajach wydatków budżetowych",false,1,2016,0,"2014-12-19","2015-01-01"]
[2015,1,"KRZYŻANÓW",1002052,2,null,860,13.7,null," Wydatki bieżące na pokrycie ujemnego wyniku finansowego samodzielnego publicznego zakładu opieki zdrowotnej",true,0,2015,0,"2014-12-19","2015-01-01"]
[2015,1,"KRZYŻANÓW",1002052,2,null,990,16,null,"Stopnie niezachowania relacji określonych w art. 242-244 ustawy w przypadku określonym w @par16_1 ustawy",true,2,2017,0,"2014-12-19","2015-01-01"]
[2015,1,"KRZYŻANÓW",1002052,2,null,320,"5.1.1","[5.1.1.1] + [5.1.1.2] + [5.1.1.3]","  w tym łączna kwota przypadających na dany rok kwot ustawowych wyłączeń z limitu spłaty zobowiązań, o którym mowa w art. 243 ustawy, z tego:",true,2,2017,0,"2014-12-19","2015-01-01"]
[2015,1,"KRZYŻANÓW",1002052,2,null,763,12.5,null," Wydatki na wkład krajowy w związku z umową na realizację programu, projektu lub zadania finansowanego z udziałem środków, o których mowa w art. 5 ust. 1 pkt 2 ustawy bez względu na stopień finansowania tymi środkami ",true,2,2017,0,"2014-12-19","2015-01-01"]
[2015,1,"KRZYŻANÓW",1002052,2,null,690,"12.1.1.1",null,"   - w tym środki określone w art. 5 ust. 1 pkt 2 ustawy wynikające wyłącznie z  zawartych umów na realizację programu, projektu lub zadania",true,3,2018,0,"2014-12-19","2015-01-01"]
[2015,1,"KRZYŻANÓW",1002052,2,null,540,"9.7.1","[9.6.1]-[9.4]","  Informacja o spełnieniu wskaźnika spłaty zobowiązań określonego w art. 243 ustawy, po uwzględnieniu zobowiązań związku współtworzonego przez jednostkę samorządu terytorialnego oraz po uwzględnieniu ustawowych wyłączeń, obliczonego w oparciu o wykonanie roku poprzedzającego rok budżetowy",false,0,2015,1846,"2014-12-19","2015-01-01"]
[2015,1,"KRZYŻANÓW",1002052,2,null,690,"12.1.1.1",null,"   - w tym środki określone w art. 5 ust. 1 pkt 2 ustawy wynikające wyłącznie z  zawartych umów na realizację programu, projektu lub zadania",true,1,2016,0,"2014-12-19","2015-01-01"]
[2015,1,"KRZYŻANÓW",1002052,2,null,336,"5.1.1.3",null,"   kwota przypadających na dany rok kwot ustawowych wyłączeń innych niż określone w art. 243 ustawy",true,3,2018,0,"2014-12-19","2015-01-01"]
[2015,1,"KRZYŻANÓW",1002052,2,null,410,8,null,"Relacja zrównoważenia wydatków bieżących, o której mowa w art. 242 ustawy",true,1,2016,0,"2014-12-19","2015-01-01"]
[2015,1,"KRZYŻANÓW",1002052,2,null,320,"5.1.1","[5.1.1.1] + [5.1.1.2] + [5.1.1.3]","  w tym łączna kwota przypadających na dany rok kwot ustawowych wyłączeń z limitu spłaty zobowiązań, o którym mowa w art. 243 ustawy, z tego:",true,3,2018,0,"2014-12-19","2015-01-01"]
[2015,1,"KRZYŻANÓW",1002052,2,null,766,"12.6.1",null,"  w tym w związku z już zawartą umową na realizację programu, projektu lub zadania",true,2,2017,0,"2014-12-19","2015-01-01"]
[2015,1,"KRZYŻANÓW",1002052,2,null,810,13.2,null," Dochody budżetowe z tytułu dotacji celowej z budżetu państwa, o której mowa w art. 196 ustawy z  dnia 15 kwietnia 2011 r.  o działalności leczniczej (Dz.U. Nr 112, poz. 654, z późn. zm.)",true,2,2017,0,"2014-12-19","2015-01-01"]
[2015,1,"KRZYŻANÓW",1002052,2,null,800,13.1,null," Kwota zobowiązań wynikających z przejęcia przez jednostkę samorządu terytorialnego zobowiązań po likwidowanych i przekształcanych samodzielnych zakładach opieki zdrowotnej",true,0,2015,0,"2014-12-19","2015-01-01"]
[2015,1,"KRZYŻANÓW",1002052,2,null,710,"12.2.1",null,"   -  w tym środki określone w art. 5 ust. 1 pkt 2 ustawy",false,1,2016,0,"2014-12-19","2015-01-01"]
[2015,1,"KRZYŻANÓW",1002052,2,null,710,"12.2.1",null,"   -  w tym środki określone w art. 5 ust. 1 pkt 2 ustawy",false,0,2015,0,"2014-12-19","2015-01-01"]
[2015,1,"KRZYŻANÓW",1002052,2,null,763,12.5,null," Wydatki na wkład krajowy w związku z umową na realizację programu, projektu lub zadania finansowanego z udziałem środków, o których mowa w art. 5 ust. 1 pkt 2 ustawy bez względu na stopień finansowania tymi środkami ",true,3,2018,0,"2014-12-19","2015-01-01"]
[2015,1,"KRZYŻANÓW",1002052,2,null,910,"14.3.1",null,"  spłata zobowiązań wymagalnych z lat poprzednich, innych niż w pkt 14.3.3",true,2,2017,0,"2014-12-19","2015-01-01"]
[2015,1,"KRZYŻANÓW",1002052,2,null,766,"12.6.1",null,"  w tym w związku z już zawartą umową na realizację programu, projektu lub zadania",true,1,2016,0,"2014-12-19","2015-01-01"]
[2015,1,"KRZYŻANÓW",1002052,2,null,767,12.7,null," Przychody z tytułu kredytów, pożyczek, emisji papierów wartościowych powstające w związku z umową na realizację programu, projektu lub zadania finansowanego z udziałem środków, o których mowa w art. 5 ust. 1 pkt 2 ustawy bez względu na stopień finansowania tymi środkami ",true,1,2016,0,"2014-12-19","2015-01-01"]
[2015,1,"KRZYŻANÓW",1002052,2,null,680,"12.1.1",null,"  -  w tym środki określone w art. 5 ust. 1 pkt 2 ustawy",true,3,2018,0,"2014-12-19","2015-01-01"]
[2015,1,"KRZYŻANÓW",1002052,2,null,890,14.2,null," Kwota długu, którego planowana spłata dokona się z wydatków budżetu",true,3,2018,0,"2014-12-19","2015-01-01"]
[2015,1,"KRZYŻANÓW",1002052,2,null,140,"2.1.1",null,"  z tytułu poręczeń i gwarancji",true,0,2015,0,"2014-12-19","2015-01-01"]
[2015,1,"KRZYŻANÓW",1002052,2,null,750,"12.3.2",null,"  Wydatki bieżące na realizację programu, projektu lub zadania wynikające wyłącznie z zawartych umów z podmiotem dysponującym środkami, o których mowa w art. 5 ust. 1 pkt 2 ustawy ",false,2,2017,0,"2014-12-19","2015-01-01"]
[2015,1,"KRZYŻANÓW",1002052,2,null,100,"1.2.1",null,"  ze sprzedaży majątku",true,2,2017,0,"2014-12-19","2015-01-01"]
[2015,1,"KRZYŻANÓW",1002052,2,null,260,4.3,null,"  Kredyty, pożyczki, emisja papierów wartościowych",true,2,2017,0,"2014-12-19","2015-01-01"]
[2015,1,"KRZYŻANÓW",1002052,2,null,340,5.2,null," Inne rozchody niezwiązane ze spłatą długu",false,1,2016,0,"2014-12-19","2015-01-01"]
[2015,1,"KRZYŻANÓW",1002052,2,null,430,8.1999999999999993,"[1.1] + [4.1] + [4.2] - (  [2.1] - [2.1.2]  )"," Różnica między dochodami bieżącymi, skorygowanymi o środki a wydatkami bieżącymi, pomniejszonymi  o wydatki",false,3,2018,3349090,"2014-12-19","2015-01-01"]
[2015,1,"KRZYŻANÓW",1002052,2,null,340,5.2,null," Inne rozchody niezwiązane ze spłatą długu",false,0,2015,0,"2014-12-19","2015-01-01"]
[2015,1,"KRZYŻANÓW",1002052,2,null,40,"1.1.2",null,"  dochody z tytułu udziału we wpływach z podatku dochodowego od osób prawnych",true,0,2015,2000,"2014-12-19","2015-01-01"]
[2015,1,"KRZYŻANÓW",1002052,2,null,130,2.1,null," Wydatki bieżące, w tym:",true,0,2015,9369229,"2014-12-19","2015-01-01"]
[2015,1,"KRZYŻANÓW",1002052,2,null,840,13.5,null," Wydatki na spłatę przejętych zobowiązań samodzielnego publicznego zakładu opieki zdrowotnej likwidowanego na zasadach określonych w przepisach  o działalności leczniczej",true,0,2015,0,"2014-12-19","2015-01-01"]
[2015,1,"KRZYŻANÓW",1002052,2,null,20,1.1000000000000001,null," Dochody bieżące",true,1,2016,13116110,"2014-12-19","2015-01-01"]
[2015,1,"KRZYŻANÓW",1002052,2,null,650,11.6,null," Wydatki majątkowe w formie dotacji ",true,2,2017,0,"2014-12-19","2015-01-01"]
[2015,1,"KRZYŻANÓW",1002052,2,null,520,"9.6.1",null,"   Dopuszczalny wskaźnik spłaty zobowiązań określony w art. 243 ustawy, po uwzględnieniu ustawowych wyłączeń, obliczony w oparciu o wykonanie roku poprzedzającego pierwszy rok prognozy (wskaźnik ustalony w oparciu o średnią arytmetyczną z 3 poprzednich lat) ",true,0,2015,0.2072,"2014-12-19","2015-01-01"]
[2015,1,"KRZYŻANÓW",1002052,2,null,50,"1.1.3",null,"  podatki i opłaty",true,2,2017,5901244,"2014-12-19","2015-01-01"]
[2015,1,"KRZYŻANÓW",1002052,2,null,810,13.2,null," Dochody budżetowe z tytułu dotacji celowej z budżetu państwa, o której mowa w art. 196 ustawy z  dnia 15 kwietnia 2011 r.  o działalności leczniczej (Dz.U. Nr 112, poz. 654, z późn. zm.)",true,1,2016,0,"2014-12-19","2015-01-01"]
[2015,1,"KRZYŻANÓW",1002052,2,null,764,"12.5.1",null,"  w tym w związku z już zawartą umową na realizację programu, projektu lub zadania",true,0,2015,0,"2014-12-19","2015-01-01"]
[2015,1,"KRZYŻANÓW",1002052,2,null,640,11.5,null," Nowe wydatki inwestycyjne",true,0,2015,2899615,"2014-12-19","2015-01-01"]
[2015,1,"KRZYŻANÓW",1002052,2,null,420,8.1,"[1.1] - [2.1]"," Różnica między dochodami bieżącymi a  wydatkami bieżącymi",false,0,2015,2508107,"2014-12-19","2015-01-01"]
[2015,1,"KRZYŻANÓW",1002052,2,null,500,9.4,"(([2.1.1]-[2.1.1.1]) + ([2.1.3.1]-[2.1.3.1.1]-[2.1.3.1.2])+([5.1]-[5.1.1])+[9.3]) /([1]-[15.1.1])"," Wskaźnik planowanej łącznej kwoty spłaty zobowiązań, o której mowa w art. 243 ust. 1 ustawy do dochodów, po uwzględnieniu zobowiązań związku współtworzonego przez jednostkę samorządu terytorialnego oraz po uwzględnieniu ustawowych wyłączeń przypadających na dany rok",false,2,2017,5.5500000000000001E-2,"2014-12-19","2015-01-01"]
[2015,1,"KRZYŻANÓW",1002052,2,null,890,14.2,null," Kwota długu, którego planowana spłata dokona się z wydatków budżetu",true,1,2016,0,"2014-12-19","2015-01-01"]
[2015,1,"KRZYŻANÓW",1002052,2,null,764,"12.5.1",null,"  w tym w związku z już zawartą umową na realizację programu, projektu lub zadania",true,1,2016,0,"2014-12-19","2015-01-01"]
[2015,1,"KRZYŻANÓW",1002052,2,null,810,13.2,null," Dochody budżetowe z tytułu dotacji celowej z budżetu państwa, o której mowa w art. 196 ustawy z  dnia 15 kwietnia 2011 r.  o działalności leczniczej (Dz.U. Nr 112, poz. 654, z późn. zm.)",true,0,2015,0,"2014-12-19","2015-01-01"]
[2015,1,"KRZYŻANÓW",1002052,2,null,765,12.6,null," Wydatki na wkład krajowy w związku z zawartą po dniu 1 stycznia 2013 r. umową na realizację programu, projektu lub zadania finansowanego w co najmniej 60% środkami, o których mowa w art. 5 ust. 1 pkt 2 ustawy",true,0,2015,0,"2014-12-19","2015-01-01"]
[2015,1,"KRZYŻANÓW",1002052,2,null,490,9.3000000000000007,null," Kwota zobowiązań związku współtworzonego przez jednostkę samorządu terytorialnego przypadających do spłaty w danym roku budżetowym, podlegająca doliczeniu zgodnie z art. 244 ustawy",true,3,2018,0,"2014-12-19","2015-01-01"]
[2015,1,"KRZYŻANÓW",1002052,2,null,350,6,null,"Kwota długu",true,0,2015,1402787.6,"2014-12-19","2015-01-01"]
[2015,1,"KRZYŻANÓW",1002052,2,null,763,12.5,null," Wydatki na wkład krajowy w związku z umową na realizację programu, projektu lub zadania finansowanego z udziałem środków, o których mowa w art. 5 ust. 1 pkt 2 ustawy bez względu na stopień finansowania tymi środkami ",true,0,2015,0,"2014-12-19","2015-01-01"]
[2015,1,"KRZYŻANÓW",1002052,2,null,650,11.6,null," Wydatki majątkowe w formie dotacji ",true,0,2015,0,"2014-12-19","2015-01-01"]
[2015,1,"KRZYŻANÓW",1002052,2,null,940,14.4,null," Wynik operacji niekasowych wpływających na kwotę długu ( m.in. umorzenia, różnice kursowe)",true,2,2017,0,"2014-12-19","2015-01-01"]
[2015,1,"KRZYŻANÓW",1002052,2,null,180,"2.1.3.1",null,"   odsetki i dyskonto określone w art. 243 ust. 1 ustawy, w tym:",false,2,2017,34000,"2014-12-19","2015-01-01"]
[2015,1,"KRZYŻANÓW",1002052,2,null,1010,16.2,null," Stopień niezachowania wskaźnika spłaty zobowiązań, o którym mowa w poz. 9.7.",true,1,2016,0,"2014-12-19","2015-01-01"]
[2015,1,"KRZYŻANÓW",1002052,2,null,920,"14.3.2",null,"  związane z umowami zaliczanymi do tytułów dłużnych wliczanych do państwowego długu publicznego",true,1,2016,0,"2014-12-19","2015-01-01"]
[2015,1,"KRZYŻANÓW",1002052,2,null,850,13.6,null," Wydatki na spłatę zobowiązań samodzielnego publicznego zakładu opieki zdrowotnej przejętych do końca 2011 r. na podstawie przepisów o zakładach opieki zdrowotnej",true,2,2017,0,"2014-12-19","2015-01-01"]
[2015,1,"KRZYŻANÓW",1002052,2,null,130,2.1,null," Wydatki bieżące, w tym:",true,1,2016,9654720,"2014-12-19","2015-01-01"]
[2015,1,"KRZYŻANÓW",1002052,2,null,182,"2.1.3.1.1",null,"    odsetki i dyskonto podlegające wyłączeniu z limitu spłaty zobowiązań, o którym mowa w art. 243 ustawy, w terminie nie dłuższym niż 90 dni po zakończeniu programu, projektu lub zadania i otrzymaniu refundacji z tych środków (bez odsetek i dyskonta od zobowiązań na wkład krajowy)",false,0,2015,0,"2014-12-19","2015-01-01"]
[2015,1,"KRZYŻANÓW",1002052,2,null,182,"2.1.3.1.1",null,"    odsetki i dyskonto podlegające wyłączeniu z limitu spłaty zobowiązań, o którym mowa w art. 243 ustawy, w terminie nie dłuższym niż 90 dni po zakończeniu programu, projektu lub zadania i otrzymaniu refundacji z tych środków (bez odsetek i dyskonta od zobowiązań na wkład krajowy)",false,1,2016,0,"2014-12-19","2015-01-01"]
[2015,1,"KRZYŻANÓW",1002052,2,null,680,"12.1.1",null,"  -  w tym środki określone w art. 5 ust. 1 pkt 2 ustawy",true,1,2016,0,"2014-12-19","2015-01-01"]
[2015,1,"KRZYŻANÓW",1002052,2,null,920,"14.3.2",null,"  związane z umowami zaliczanymi do tytułów dłużnych wliczanych do państwowego długu publicznego",true,3,2018,0,"2014-12-19","2015-01-01"]
[2015,1,"KRZYŻANÓW",1002052,2,null,610,"11.3.1",null,"   bieżące",true,0,2015,0,"2014-12-19","2015-01-01"]
[2015,1,"KRZYŻANÓW",1002052,2,null,10,1,"[1.1] + [1.2]","Dochody ogółem",true,0,2015,11885236,"2014-12-19","2015-01-01"]